{"text_format":"1","workbook":"xlsx","n_sheets":8,"sheets":["DATOS","Hoja1","CONCILIACIÓN BANC.","ANEXO 1","ANEXO 2","ANEXO 3","ANEXO 4 ","ANEXO 5"],"not_rendered":{"charts":0,"images":1,"macros":1,"external_links":0,"defined_names":0,"comments":1,"pivot_tables":0},"unopened":[],"bounds":{"document_bytes":16777216,"sheet_cells":100000,"rows_first":2000,"rows_last":500,"rows_between":2000,"halvings":0,"cell_chars":16384,"cell_head_chars":4096},"cells_cut":0,"cells_raw":0,"read":"whole","date_system":"1900"}

{"sheet":"DATOS","index":0,"n_rows":89,"n_cols":12,"rows_kept":89,"cut":false,"hidden":false,"merged":[[1,2,4,10]]}
[]
[null,null,"IMPORTANTE INGRESAR TODOS LOS DATOS, PARA QUE LA CONCILIACIÓN NO GENERE ERRORES"]
[]
[]
[]
[null,null,"DATOS",null,null,null,null,null,null,null,"PERIODO","E"]
[null,null,"OFICINA OPERDORA",null,null,null,null,null,null,null,"MES"]
[null,"A","SELECCIÓN",null,null,null,null,null,null,null,"DICIEMBRE"]
[null,null,"AUXILIAR",null,null,null,null,null,null,null,"AÑO"]
[null,"B",null,"ERROR",null,null,null,null,null,null,"2016"]
[null,null,"CONAC"]
[null,"C","1001-2131",{"$f":"IFERROR(IF(MATCH(C12,F14:F37,0)>0,\"\",\"\"),\"ERROR\")","v":"ERROR"},"FILA INICIAL",{"$f":"MATCH(C8,Tabla1[OFICINA],0)","v":{"$error":"#N/A"}},"FILA FINAL",{"$f":"MATCH(LOOKUP(C8,Tabla1[OFICINA],Tabla1[OFICINA]),Tabla1[OFICINA])","v":195}]
[null,null,"BANCO",null,null,"CONAC"]
[null,null,{"$f":"IFERROR(INDEX(F14:G37,MATCH(C12,F14:F37,0),2),\"\")","v":""},null,{"$f":"F12","v":{"$error":"#N/A"}},{"$f":"IFERROR(IF(E14=0,\"\",INDEX(Tabla1[],E14,3)),\"\")","v":""},{"$f":"IFERROR(IF(E14=0,\"\",INDEX(Tabla1[],E14,5)),\"\")","v":""},null,null,"SELECCIÓN"]
[null,null,"No. DE CUENTA",null,{"$f":"IFERROR(IF((E14+1)<=$H$12,E14+1,\"\"),\"\")","v":""},{"$f":"IFERROR(IF(E15=0,\"\",INDEX(Tabla1[],E15,3)),\"\")","v":""},{"$f":"IFERROR(IF(E15=0,\"\",INDEX(Tabla1[],E15,5)),\"\")","v":""},null,null,"ACAYUCAN"]
[null,"D",null,"ERROR",{"$f":"IFERROR(IF((E15+1)<=$H$12,E15+1,\"\"),\"\")","v":""},{"$f":"IFERROR(IF(E16=0,\"\",INDEX(Tabla1[],E16,3)),\"\")","v":""},{"$f":"IFERROR(IF(E16=0,\"\",INDEX(Tabla1[],E16,5)),\"\")","v":""},null,null,"AGUA DULCE"]
[null,null,null,null,"",{"$f":"IFERROR(IF(E17=0,\"\",INDEX(Tabla1[],E17,3)),\"\")","v":""},{"$f":"IFERROR(IF(E17=0,\"\",INDEX(Tabla1[],E17,5)),\"\")","v":""},null,null,"ÁLAMO"]
[null,null,null,null,"",{"$f":"IFERROR(IF(E18=0,\"\",INDEX(Tabla1[],E18,3)),\"\")","v":""},{"$f":"IFERROR(IF(E18=0,\"\",INDEX(Tabla1[],E18,5)),\"\")","v":""},null,null,"ALTOTONGA"]
[null,null,null,null,"",{"$f":"IFERROR(IF(E19=0,\"\",INDEX(Tabla1[],E19,3)),\"\")","v":""},{"$f":"IFERROR(IF(E19=0,\"\",INDEX(Tabla1[],E19,5)),\"\")","v":""},null,null,"ALVARADO"]
[null,null,null,null,"",{"$f":"IFERROR(IF(E20=0,\"\",INDEX(Tabla1[],E20,3)),\"\")","v":""},{"$f":"IFERROR(IF(E20=0,\"\",INDEX(Tabla1[],E20,5)),\"\")","v":""},null,null,"ÁNGEL R. CABADA"]
[null,null,null,null,"",{"$f":"IFERROR(IF(E21=0,\"\",INDEX(Tabla1[],E21,3)),\"\")","v":""},{"$f":"IFERROR(IF(E21=0,\"\",INDEX(Tabla1[],E21,5)),\"\")","v":""},null,null,"ARROYO AZUL"]
[null,null,null,null,"",{"$f":"IFERROR(IF(E22=0,\"\",INDEX(Tabla1[],E22,3)),\"\")","v":""},{"$f":"IFERROR(IF(E22=0,\"\",INDEX(Tabla1[],E22,5)),\"\")","v":""},null,null,"CARLOS A. CARRILLO"]
[null,null,null,null,"",{"$f":"IFERROR(IF(E23=0,\"\",INDEX(Tabla1[],E23,3)),\"\")","v":""},{"$f":"IFERROR(IF(E23=0,\"\",INDEX(Tabla1[],E23,5)),\"\")","v":""},null,null,"CASTILLO DE TEAYO "]
[null,null,null,null,"",{"$f":"IFERROR(IF(E24=0,\"\",INDEX(Tabla1[],E24,3)),\"\")","v":""},{"$f":"IFERROR(IF(E24=0,\"\",INDEX(Tabla1[],E24,5)),\"\")","v":""},null,null,"CATEMACO"]
[null,null,null,null,"",{"$f":"IFERROR(IF(E25=0,\"\",INDEX(Tabla1[],E25,3)),\"\")","v":""},{"$f":"IFERROR(IF(E25=0,\"\",INDEX(Tabla1[],E25,5)),\"\")","v":""},null,null,"CAZONES"]
[null,null,null,null,"",{"$f":"IFERROR(IF(E26=0,\"\",INDEX(Tabla1[],E26,3)),\"\")","v":""},{"$f":"IFERROR(IF(E26=0,\"\",INDEX(Tabla1[],E26,5)),\"\")","v":""},null,null,"CD. ALEMÁN"]
[null,null,null,null,"",{"$f":"IFERROR(IF(E27=0,\"\",INDEX(Tabla1[],E27,3)),\"\")","v":""},{"$f":"IFERROR(IF(E27=0,\"\",INDEX(Tabla1[],E27,5)),\"\")","v":""},null,null,"CD. CUAÚHTEMOC"]
[null,null,null,null,"",{"$f":"IFERROR(IF(E28=0,\"\",INDEX(Tabla1[],E28,3)),\"\")","v":""},{"$f":"IFERROR(IF(E28=0,\"\",INDEX(Tabla1[],E28,5)),\"\")","v":""},null,null,"CD. MENDOZA"]
[null,null,null,null,"",{"$f":"IFERROR(IF(E29=0,\"\",INDEX(Tabla1[],E29,3)),\"\")","v":""},{"$f":"IFERROR(IF(E29=0,\"\",INDEX(Tabla1[],E29,5)),\"\")","v":""},null,null,"CERRO AZUL"]
[null,null,null,null,"",{"$f":"IFERROR(IF(E30=0,\"\",INDEX(Tabla1[],E30,3)),\"\")","v":""},{"$f":"IFERROR(IF(E30=0,\"\",INDEX(Tabla1[],E30,5)),\"\")","v":""},null,null,"CHACALTIANGUIS"]
[null,null,null,null,"",{"$f":"IFERROR(IF(E31=0,\"\",INDEX(Tabla1[],E31,3)),\"\")","v":""},{"$f":"IFERROR(IF(E31=0,\"\",INDEX(Tabla1[],E31,5)),\"\")","v":""},null,null,"CHICHICAXTLE"]
[null,null,null,null,"",{"$f":"IFERROR(IF(E32=0,\"\",INDEX(Tabla1[],E32,3)),\"\")","v":""},{"$f":"IFERROR(IF(E32=0,\"\",INDEX(Tabla1[],E32,5)),\"\")","v":""},null,null,"CHICONTEPEC"]
[null,null,null,null,"",{"$f":"IFERROR(IF(E33=0,\"\",INDEX(Tabla1[],E33,3)),\"\")","v":""},{"$f":"IFERROR(IF(E33=0,\"\",INDEX(Tabla1[],E33,5)),\"\")","v":""},null,null,"CHINAMECA"]
[null,null,null,null,"",{"$f":"IFERROR(IF(E34=0,\"\",INDEX(Tabla1[],E34,3)),\"\")","v":""},{"$f":"IFERROR(IF(E34=0,\"\",INDEX(Tabla1[],E34,5)),\"\")","v":""},null,null,"COATZACOALCOS"]
[null,null,null,null,"",{"$f":"IFERROR(IF(E35=0,\"\",INDEX(Tabla1[],E35,3)),\"\")","v":""},{"$f":"IFERROR(IF(E35=0,\"\",INDEX(Tabla1[],E35,5)),\"\")","v":""},null,null,"COATZINTLA"]
[null,null,null,null,"",{"$f":"IFERROR(IF(E36=0,\"\",INDEX(Tabla1[],E36,3)),\"\")","v":""},{"$f":"IFERROR(IF(E36=0,\"\",INDEX(Tabla1[],E36,5)),\"\")","v":""},null,null,"COSAMALOAPAN"]
[null,null,null,null,"",{"$f":"IFERROR(IF(E37=0,\"\",INDEX(Tabla1[],E37,3)),\"\")","v":""},{"$f":"IFERROR(IF(E37=0,\"\",INDEX(Tabla1[],E37,5)),\"\")","v":""},null,null,"COSOLEACAQUE"]
[null,null,null,null,null,null,null,null,null,"CUITLAHUAC"]
[null,null,null,null,null,null,null,null,null,"EL HIGO"]
[null,null,null,null,null,null,null,null,null,"EMILIO CARRANZA"]
[null,null,null,null,null,null,null,null,null,"GUTIÉRREZ ZAMORA"]
[null,null,null,null,null,null,null,null,null,"IGNACIO DE LA LLAVE"]
[null,null,null,null,null,null,null,null,null,"ISLA"]
[null,null,null,null,null,null,null,null,null,"IXHUATLÁN DEL CAFÉ"]
[null,null,null,null,null,null,null,null,null,"IXHUATLÁN DEL SURESTE"]
[null,null,null,null,null,null,null,null,null,"JALACINGO"]
[null,null,null,null,null,null,null,null,null,"JESÚS CARRANZA"]
[null,null,null,null,null,null,null,null,null,"JUAN DÍAZ COVARRUBIAS"]
[null,null,null,null,null,null,null,null,null,"JUAN RODRÍGUEZ CLARA"]
[null,null,null,null,null,null,null,null,null,"LAS CHOAPAS"]
[null,null,null,null,null,null,null,null,null,"LAS VIGAS"]
[null,null,null,null,null,null,null,null,null,"MALTRATA"]
[null,null,null,null,null,null,null,null,null,"MARTÍNEZ DE LA TORRE"]
[null,null,null,null,null,null,null,null,null,"MINATITLÁN"]
[null,null,null,null,null,null,null,null,null,"MISANTLA"]
[null,null,null,null,null,null,null,null,null,"NANCHITAL"]
[null,null,null,null,null,null,null,null,null,"NARANJOS"]
[null,null,null,null,null,null,null,null,null,"NOGALES"]
[null,null,null,null,null,null,null,null,null,"OFICINAS CENTRALES"]
[null,null,null,null,null,null,null,null,null,"OTATITLÁN"]
{"$rows_left_out":30}
{"sheet":"Hoja1","index":1,"n_rows":229,"n_cols":7,"rows_kept":229,"cut":false,"hidden":true,"merged":[]}
["NIVEL5","NIVEL6","CONAC","AUXILIAR","BANCO","CUENTA","OFICINA"]
[1001,2061,{"$f":"CONCATENATE(Tabla1[[#This Row],[NIVEL5]],\"-\",Tabla1[[#This Row],[NIVEL6]])","v":"1001-2061"},5820015,"BBVA BANCOMER, S.A.","0181216716","ACAYUCAN"]
[1001,2111,{"$f":"CONCATENATE(Tabla1[[#This Row],[NIVEL5]],\"-\",Tabla1[[#This Row],[NIVEL6]])","v":"1001-2111"},5820018,"BBVA BANCOMER, S.A.","0193390268","ACAYUCAN"]
[1003,2024,{"$f":"CONCATENATE(Tabla1[[#This Row],[NIVEL5]],\"-\",Tabla1[[#This Row],[NIVEL6]])","v":"1003-2024"},5820016,"SANTANDER, S.A.","65503091442","ACAYUCAN"]
[1003,2037,{"$f":"CONCATENATE(Tabla1[[#This Row],[NIVEL5]],\"-\",Tabla1[[#This Row],[NIVEL6]])","v":"1003-2037"},5820017,"SANTANDER, S.A.","65503374360","ACAYUCAN"]
[1004,2007,{"$f":"CONCATENATE(Tabla1[[#This Row],[NIVEL5]],\"-\",Tabla1[[#This Row],[NIVEL6]])","v":"1004-2007"},5820002,"SCOTIABANK  INVERLAT","07000373486","ACAYUCAN"]
[1004,2029,{"$f":"CONCATENATE(Tabla1[[#This Row],[NIVEL5]],\"-\",Tabla1[[#This Row],[NIVEL6]])","v":"1004-2029"},5820019,"SCOTIABANK  INVERLAT","07000550493","ACAYUCAN"]
[1008,2001,{"$f":"CONCATENATE(Tabla1[[#This Row],[NIVEL5]],\"-\",Tabla1[[#This Row],[NIVEL6]])","v":"1008-2001"},5820007,"AZTECA","30840143523719","ACAYUCAN"]
[1001,2063,{"$f":"CONCATENATE(Tabla1[[#This Row],[NIVEL5]],\"-\",Tabla1[[#This Row],[NIVEL6]])","v":"1001-2063"},5870003,"BBVA BANCOMER, S.A.","0181218654","AGUA DULCE"]
[1001,2139,{"$f":"CONCATENATE(Tabla1[[#This Row],[NIVEL5]],\"-\",Tabla1[[#This Row],[NIVEL6]])","v":"1001-2139"},5870005,"BBVA BANCOMER, S.A.",100956457,"AGUA DULCE"]
[1003,2072,{"$f":"CONCATENATE(Tabla1[[#This Row],[NIVEL5]],\"-\",Tabla1[[#This Row],[NIVEL6]])","v":"1003-2072"},5870004,"SANTANDER, S.A.","65504465118","AGUA DULCE"]
[1001,2036,{"$f":"CONCATENATE(Tabla1[[#This Row],[NIVEL5]],\"-\",Tabla1[[#This Row],[NIVEL6]])","v":"1001-2036"},5040004,"BBVA BANCOMER, S.A.","0181200267","ÁLAMO"]
[1001,2131,{"$f":"CONCATENATE(Tabla1[[#This Row],[NIVEL5]],\"-\",Tabla1[[#This Row],[NIVEL6]])","v":"1001-2131"},5040007,"BBVA BANCOMER, S.A.",100956716,"ÁLAMO"]
[1003,2073,{"$f":"CONCATENATE(Tabla1[[#This Row],[NIVEL5]],\"-\",Tabla1[[#This Row],[NIVEL6]])","v":"1003-2073"},5040006,"SANTANDER, S.A.","655037481777","ÁLAMO"]
[1001,2006,{"$f":"CONCATENATE(Tabla1[[#This Row],[NIVEL5]],\"-\",Tabla1[[#This Row],[NIVEL6]])","v":"1001-2006"},180002,"BBVA BANCOMER, S.A.","0181105795","ALTOTONGA"]
[1001,2146,{"$f":"CONCATENATE(Tabla1[[#This Row],[NIVEL5]],\"-\",Tabla1[[#This Row],[NIVEL6]])","v":"1001-2146"},180004,"BBVA BANCOMER, S.A.",100956988,"ALTOTONGA"]
[1003,2063,{"$f":"CONCATENATE(Tabla1[[#This Row],[NIVEL5]],\"-\",Tabla1[[#This Row],[NIVEL6]])","v":"1003-2063"},180003,"SANTANDER, S.A.","800057627692","ALTOTONGA"]
[1003,2057,{"$f":"CONCATENATE(Tabla1[[#This Row],[NIVEL5]],\"-\",Tabla1[[#This Row],[NIVEL6]])","v":"1003-2057"},5530003,"SANTANDER, S.A.","65502922576","ALVARADO"]
[1003,2058,{"$f":"CONCATENATE(Tabla1[[#This Row],[NIVEL5]],\"-\",Tabla1[[#This Row],[NIVEL6]])","v":"1003-2058"},5530004,"SANTANDER, S.A.","92001813262","ALVARADO"]
[1005,2013,{"$f":"CONCATENATE(Tabla1[[#This Row],[NIVEL5]],\"-\",Tabla1[[#This Row],[NIVEL6]])","v":"1005-2013"},5530001,"HSBC","4050433622","ALVARADO"]
[1005,2014,{"$f":"CONCATENATE(Tabla1[[#This Row],[NIVEL5]],\"-\",Tabla1[[#This Row],[NIVEL6]])","v":"1005-2014"},5530002,"HSBC","4051738524","ALVARADO"]
[1005,2015,{"$f":"CONCATENATE(Tabla1[[#This Row],[NIVEL5]],\"-\",Tabla1[[#This Row],[NIVEL6]])","v":"1005-2015"},5530005,"HSBC","4056680200","ALVARADO"]
[1001,2057,{"$f":"CONCATENATE(Tabla1[[#This Row],[NIVEL5]],\"-\",Tabla1[[#This Row],[NIVEL6]])","v":"1001-2057"},5760002,"BBVA BANCOMER, S.A.","0442099527","ÁNGEL R. CABADA"]
[1001,2058,{"$f":"CONCATENATE(Tabla1[[#This Row],[NIVEL5]],\"-\",Tabla1[[#This Row],[NIVEL6]])","v":"1001-2058"},5760003,"BBVA BANCOMER, S.A.","0159003312","ÁNGEL R. CABADA"]
[1001,2083,{"$f":"CONCATENATE(Tabla1[[#This Row],[NIVEL5]],\"-\",Tabla1[[#This Row],[NIVEL6]])","v":"1001-2083"},5760005,"BBVA BANCOMER, S.A.","0181197673","ÁNGEL R. CABADA"]
[1001,2148,{"$f":"CONCATENATE(Tabla1[[#This Row],[NIVEL5]],\"-\",Tabla1[[#This Row],[NIVEL6]])","v":"1001-2148"},5760006,"BBVA BANCOMER, S.A.",100957372,"ÁNGEL R. CABADA"]
[1006,2015,{"$f":"CONCATENATE(Tabla1[[#This Row],[NIVEL5]],\"-\",Tabla1[[#This Row],[NIVEL6]])","v":"1006-2015"},5760001,"BANORTE, S.A.","0149298102","ÁNGEL R. CABADA"]
[1004,2010,{"$f":"CONCATENATE(Tabla1[[#This Row],[NIVEL5]],\"-\",Tabla1[[#This Row],[NIVEL6]])","v":"1004-2010"},9000027,"SCOTIABANK  INVERLAT","5905274451","ARROYO AZUL"]
[1003,2079,{"$f":"CONCATENATE(Tabla1[[#This Row],[NIVEL5]],\"-\",Tabla1[[#This Row],[NIVEL6]])","v":"1003-2079"},1400003,"SANTANDER, S.A.","65505281831","CARLOS A. CARRILLO"]
[1003,2081,{"$f":"CONCATENATE(Tabla1[[#This Row],[NIVEL5]],\"-\",Tabla1[[#This Row],[NIVEL6]])","v":"1003-2081"},1400004,"SANTANDER, S.A.","65505016979","CARLOS A. CARRILLO"]
[1003,2029,{"$f":"CONCATENATE(Tabla1[[#This Row],[NIVEL5]],\"-\",Tabla1[[#This Row],[NIVEL6]])","v":"1003-2029"},9000043,"SANTANDER, S.A.","92001809559","CASTILLO DE TEAYO "]
[1001,2049,{"$f":"CONCATENATE(Tabla1[[#This Row],[NIVEL5]],\"-\",Tabla1[[#This Row],[NIVEL6]])","v":"1001-2049"},5430003,"BBVA BANCOMER, S.A.","0181192655","CATEMACO"]
[1001,2118,{"$f":"CONCATENATE(Tabla1[[#This Row],[NIVEL5]],\"-\",Tabla1[[#This Row],[NIVEL6]])","v":"1001-2118"},5430004,"BBVA BANCOMER, S.A.",100958301,"CATEMACO"]
[1001,2022,{"$f":"CONCATENATE(Tabla1[[#This Row],[NIVEL5]],\"-\",Tabla1[[#This Row],[NIVEL6]])","v":"1001-2022"},520002,"BBVA BANCOMER, S.A.","00181223534","CAZONES"]
[1001,2150,{"$f":"CONCATENATE(Tabla1[[#This Row],[NIVEL5]],\"-\",Tabla1[[#This Row],[NIVEL6]])","v":"1001-2150"},520003,"BBVA BANCOMER, S.A.",100976571,"CAZONES"]
[1003,2011,{"$f":"CONCATENATE(Tabla1[[#This Row],[NIVEL5]],\"-\",Tabla1[[#This Row],[NIVEL6]])","v":"1003-2011"},2220003,"SANTANDER, S.A.","92001602403","CD. ALEMÁN"]
[1003,2083,{"$f":"CONCATENATE(Tabla1[[#This Row],[NIVEL5]],\"-\",Tabla1[[#This Row],[NIVEL6]])","v":"1003-2083"},2220004,"SANTANDER, S.A.","65505020509","CD. ALEMÁN"]
[1003,2084,{"$f":"CONCATENATE(Tabla1[[#This Row],[NIVEL5]],\"-\",Tabla1[[#This Row],[NIVEL6]])","v":"1003-2084"},2220005,"SANTANDER, S.A.","65505706314","CD. ALEMÁN"]
[1003,2018,{"$f":"CONCATENATE(Tabla1[[#This Row],[NIVEL5]],\"-\",Tabla1[[#This Row],[NIVEL6]])","v":"1003-2018"},5510001,"SANTANDER, S.A.","92000353888","CD. CUAÚHTEMOC"]
[1003,2019,{"$f":"CONCATENATE(Tabla1[[#This Row],[NIVEL5]],\"-\",Tabla1[[#This Row],[NIVEL6]])","v":"1003-2019"},5510002,"SANTANDER, S.A.","65502013262","CD. CUAÚHTEMOC"]
[1003,2020,{"$f":"CONCATENATE(Tabla1[[#This Row],[NIVEL5]],\"-\",Tabla1[[#This Row],[NIVEL6]])","v":"1003-2020"},5510003,"SANTANDER, S.A.","92001390610","CD. CUAÚHTEMOC"]
[1005,2016,{"$f":"CONCATENATE(Tabla1[[#This Row],[NIVEL5]],\"-\",Tabla1[[#This Row],[NIVEL6]])","v":"1005-2016"},5560003,"HSBC","021852040564630378","CD. MENDOZA"]
[1001,2067,{"$f":"CONCATENATE(Tabla1[[#This Row],[NIVEL5]],\"-\",Tabla1[[#This Row],[NIVEL6]])","v":"1001-2067"},5960002,"BBVA BANCOMER, S.A.","0181220217","CERRO AZUL"]
[1001,2115,{"$f":"CONCATENATE(Tabla1[[#This Row],[NIVEL5]],\"-\",Tabla1[[#This Row],[NIVEL6]])","v":"1001-2115"},5960007,"BBVA BANCOMER, S.A.",198029466,"CERRO AZUL"]
[1001,2123,{"$f":"CONCATENATE(Tabla1[[#This Row],[NIVEL5]],\"-\",Tabla1[[#This Row],[NIVEL6]])","v":"1001-2123"},5960008,"BBVA BANCOMER, S.A.",100958360,"CERRO AZUL"]
[1002,2024,{"$f":"CONCATENATE(Tabla1[[#This Row],[NIVEL5]],\"-\",Tabla1[[#This Row],[NIVEL6]])","v":"1002-2024"},5960006,"BANAMEX, S.A.","1812990","CERRO AZUL"]
[1003,2047,{"$f":"CONCATENATE(Tabla1[[#This Row],[NIVEL5]],\"-\",Tabla1[[#This Row],[NIVEL6]])","v":"1003-2047"},5960005,"SANTANDER, S.A.","65503748129","CERRO AZUL"]
[1003,2010,{"$f":"CONCATENATE(Tabla1[[#This Row],[NIVEL5]],\"-\",Tabla1[[#This Row],[NIVEL6]])","v":"1003-2010"},1420001,"SANTANDER, S.A.","92001178176","CHACALTIANGUIS"]
[1001,2015,{"$f":"CONCATENATE(Tabla1[[#This Row],[NIVEL5]],\"-\",Tabla1[[#This Row],[NIVEL6]])","v":"1001-2015"},420004,"BBVA BANCOMER, S.A.","0181282859","CHICHICAXTLE"]
[1001,2032,{"$f":"CONCATENATE(Tabla1[[#This Row],[NIVEL5]],\"-\",Tabla1[[#This Row],[NIVEL6]])","v":"1001-2032"},1440002,"BBVA BANCOMER, S.A.","0181282395","CHICONTEPEC"]
[1001,2121,{"$f":"CONCATENATE(Tabla1[[#This Row],[NIVEL5]],\"-\",Tabla1[[#This Row],[NIVEL6]])","v":"1001-2121"},1440003,"BBVA BANCOMER, S.A.",100958743,"CHICONTEPEC"]
[1001,2018,{"$f":"CONCATENATE(Tabla1[[#This Row],[NIVEL5]],\"-\",Tabla1[[#This Row],[NIVEL6]])","v":"1001-2018"},470002,"BBVA BANCOMER, S.A.","0181105442","CHINAMECA"]
[1001,2122,{"$f":"CONCATENATE(Tabla1[[#This Row],[NIVEL5]],\"-\",Tabla1[[#This Row],[NIVEL6]])","v":"1001-2122"},470003,"BBVA BANCOMER, S.A.",100959073,"CHINAMECA"]
[1001,2016,{"$f":"CONCATENATE(Tabla1[[#This Row],[NIVEL5]],\"-\",Tabla1[[#This Row],[NIVEL6]])","v":"1001-2016"},450013,"BBVA BANCOMER, S.A.","0180809179","COATZACOALCOS"]
[1001,2017,{"$f":"CONCATENATE(Tabla1[[#This Row],[NIVEL5]],\"-\",Tabla1[[#This Row],[NIVEL6]])","v":"1001-2017"},450014,"BBVA BANCOMER, S.A.","0184917200","COATZACOALCOS"]
[1002,2005,{"$f":"CONCATENATE(Tabla1[[#This Row],[NIVEL5]],\"-\",Tabla1[[#This Row],[NIVEL6]])","v":"1002-2005"},450012,"BANAMEX, S.A.","6600447","COATZACOALCOS"]
[1002,2006,{"$f":"CONCATENATE(Tabla1[[#This Row],[NIVEL5]],\"-\",Tabla1[[#This Row],[NIVEL6]])","v":"1002-2006"},450015,"BANAMEX, S.A.","2924362","COATZACOALCOS"]
[1002,2007,{"$f":"CONCATENATE(Tabla1[[#This Row],[NIVEL5]],\"-\",Tabla1[[#This Row],[NIVEL6]])","v":"1002-2007"},450018,"BANAMEX, S.A.","2842110","COATZACOALCOS"]
[1002,2008,{"$f":"CONCATENATE(Tabla1[[#This Row],[NIVEL5]],\"-\",Tabla1[[#This Row],[NIVEL6]])","v":"1002-2008"},450019,"BANAMEX, S.A.","28929526","COATZACOALCOS"]
[1002,2009,{"$f":"CONCATENATE(Tabla1[[#This Row],[NIVEL5]],\"-\",Tabla1[[#This Row],[NIVEL6]])","v":"1002-2009"},450020,"BANAMEX, S.A.","177906","COATZACOALCOS"]
{"$rows_left_out":170}
{"sheet":"CONCILIACIÓN BANC.","index":2,"n_rows":34,"n_cols":9,"rows_kept":34,"cut":false,"hidden":true,"merged":[[24,5,24,7],[2,1,2,8],[7,7,7,8],[12,4,12,5],[12,7,12,8],[4,1,4,8],[5,7,5,8],[5,1,5,4],[7,2,7,3],[9,2,9,3],[9,7,9,8],[3,1,3,5]]}
[]
[]
[]
[null,"CONCILIACION BANCARIA",null,null,null,null,null,"CONAC",{"$f":"IFERROR(IF(MATCH(DATOS!C12,DATOS!F14:F37,0)>0,DATOS!C12,\"\"),\"ERROR\")","v":"ERROR"}]
[]
[null,{"$f":"CONCATENATE(\"OFICINA OPERADORA: \",DATOS!C8)","v":"OFICINA OPERADORA: SELECCIÓN"},null,null,null,"No. AUXILIAR:",null,{"$f":"IF(DATOS!C10=0,\"INGRESAR DATO\",DATOS!C10)","v":"INGRESAR DATO"}]
[]
[null,"BANCO: ",{"$f":"IF(DATOS!C14=\"\",\"ERROR\",DATOS!C14)","v":"ERROR"},null,null,"No. CTA/CLABE:",null,{"$f":"IF(DATOS!C16=0,\"INGRESAR DATO\",DATOS!C16)","v":"INGRESAR DATO"}]
[null,null,null,null,null,null," "]
[null,"MES:",{"$f":"IF(DATOS!K8=\"\",\"INDICAR MES\",DATOS!K8)","v":"DICIEMBRE"},null,null,"AÑO:",null,{"$f":"IF(DATOS!K10=\"\",\"INDICAR AÑO\",DATOS!K10)","v":"2016"}]
[]
[]
[null,null,null,null,"AUXILIAR",null,null,"BANCO"]
[null,null,null,null,"DEBE  ","HABER",null,"DEBE  ","HABER"]
[null,null,"SALDO  A LA FECHA  ",null,1000,null,null,null,1000]
[]
[null,null,"AUXILIAR"]
[null,null,"PENDIENTES  DE  CONCILIAR",null," "]
[]
[null,"ANEXO  1","DEPOSITOS DEL  BANCO  NO  CONSIDERADOS  EN  LIBROS",null,{"$f":"'ANEXO 1'!F44","v":0}]
[]
[null,"ANEXO  2","CARGOS  DEL  BANCO  NO  CONSIDERADOS  EN  LIBROS",null,null,{"$f":"'ANEXO 2'!F44","v":0}]
[]
[null,null,"BANCO"]
[null,"ANEXO 3","DEPOSITOS NO CONSIDERADOS  POR EL  BANCO",null,null,"DESCUADRADA",null,null,{"$f":"'ANEXO 3'!F44","v":0}]
[]
[null,"ANEXO  4","CHEQUES  AUN  NO  PAGADOS POR EL  BANCO",null,null,null,null,{"$f":"'ANEXO 4 '!F44","v":500}]
[]
[null,null,"PENDIENTES  DE  ACLARAR  POR EL  BANCO"]
[null,"ANEXO  5","POR  TODOS LOS  CARGOS  Y/O ABONOS  EFECTUADOS  POR   EL  BANCO NO CORRESPONDIENTES  A  LA CUENTA  EN  PROCESO",null,null,null,null,null,0]
[]
[null,null,"SUMAS",null,{"$f":"SUM(E15:E31)","v":1000},{"$f":"SUM(F15:F31)","v":0},null,{"$f":"SUM(H15:H31)","v":500},{"$f":"SUM(I15:I31)","v":1000}]
[null,null,"SALDOS  CONCILIADOS",null,null,{"$f":"+E32-F32","v":1000},null,{"$f":"I32-H32","v":500}]
[null,null,"SUMAS  IGUALES",null,{"$f":"SUM(E32:E33)","v":1000},{"$f":"SUM(F32:F33)","v":1000},null,{"$f":"SUM(H32:H33)","v":1000},{"$f":"SUM(I32:I33)","v":1000}]

{"sheet":"ANEXO 1","index":3,"n_rows":44,"n_cols":6,"rows_kept":44,"cut":false,"hidden":true,"merged":[[6,2,6,3],[8,2,8,3],[10,1,11,5],[4,1,4,3],[2,1,2,3]]}
[]
[]
[null,"CONCILIACION BANCARIA",null,null,"CONAC",{"$f":"'CONCILIACIÓN BANC.'!I4","v":"ERROR"}]
[]
[null,{"$f":"'CONCILIACIÓN BANC.'!B6:E6","v":"OFICINA OPERADORA: SELECCIÓN"},null,null,"No. AUXILIAR:",{"$f":"'CONCILIACIÓN BANC.'!H6","v":"INGRESAR DATO"}]
[]
[null,"BANCO:",{"$f":"'CONCILIACIÓN BANC.'!C8","v":"ERROR"},null,"No. CTA/CLABE:",{"$f":"'CONCILIACIÓN BANC.'!H8","v":"INGRESAR DATO"}]
[null,null,null,null,null," "]
[null,"MES:",{"$f":"'CONCILIACIÓN BANC.'!C10:D10","v":"DICIEMBRE"},null,"AÑO:",{"$f":"'CONCILIACIÓN BANC.'!H10","v":"2016"}]
[]
[null,"ANEXO 1 .-  DEPÓSITOS DEL BANCO NO CONSIDERADOS EN LIBROS"]
[]
[]
[null,"FECHA","IMPORTE",null,"FECHA","IMPORTE"]
[]
[]
[]
[]
[]
[]
[]
[]
[]
[]
[]
[]
[]
[]
[]
[]
[]
[]
[]
[]
[]
[]
[]
[]
[]
[]
[]
[]
[]
[null,"SUMA:",{"$f":"SUM(C15:C43)","v":0},null,"SUMA:",{"$f":"SUM(F15:F43)","v":0}]

{"sheet":"ANEXO 2","index":4,"n_rows":44,"n_cols":6,"rows_kept":44,"cut":false,"hidden":true,"merged":[[10,1,11,5],[6,2,6,3],[8,2,8,3],[4,1,4,3],[2,1,2,3]]}
[]
[]
[null,"CONCILIACION BANCARIA",null,null,"CONAC",{"$f":"'CONCILIACIÓN BANC.'!I4","v":"ERROR"}]
[]
[null,{"$f":"'CONCILIACIÓN BANC.'!B6:E6","v":"OFICINA OPERADORA: SELECCIÓN"},null,null,"No. AUXILIAR:",{"$f":"'CONCILIACIÓN BANC.'!H6","v":"INGRESAR DATO"}]
[]
[null,"BANCO:",{"$f":"'CONCILIACIÓN BANC.'!C8","v":"ERROR"},null,"No. CTA/CLABE:",{"$f":"'CONCILIACIÓN BANC.'!H8","v":"INGRESAR DATO"}]
[null,null,null,null,null," "]
[null,"MES:",{"$f":"'CONCILIACIÓN BANC.'!C10:D10","v":"DICIEMBRE"},null,"AÑO:",{"$f":"'CONCILIACIÓN BANC.'!H10","v":"2016"}]
[]
[null,"ANEXO 2 .-  CARGOS DEL BANCO NO CONSIDERADOS EN  LIBROS"]
[]
[]
[null,"FECHA","IMPORTE",null,"FECHA","IMPORTE"]
[]
[]
[]
[]
[]
[]
[]
[]
[]
[]
[]
[]
[]
[]
[]
[]
[]
[]
[]
[]
[]
[]
[]
[]
[]
[]
[]
[]
[]
[null,"SUMA:",{"$f":"SUM(C15:C43)","v":0},null,"SUMA:",{"$f":"SUM(F15:F43)","v":0}]

{"sheet":"ANEXO 3","index":5,"n_rows":44,"n_cols":6,"rows_kept":44,"cut":false,"hidden":true,"merged":[[10,1,11,5],[6,2,6,3],[4,1,4,3],[8,2,8,3],[2,1,2,3]]}
[]
[]
[null,"CONCILIACION BANCARIA",null,null,"CONAC",{"$f":"'CONCILIACIÓN BANC.'!I4","v":"ERROR"}]
[]
[null,{"$f":"'CONCILIACIÓN BANC.'!B6:E6","v":"OFICINA OPERADORA: SELECCIÓN"},null,null,"No. AUXILIAR:",{"$f":"'CONCILIACIÓN BANC.'!H6","v":"INGRESAR DATO"}]
[]
[null,"BANCO:",{"$f":"'CONCILIACIÓN BANC.'!C8","v":"ERROR"},null,"No. CTA/CLABE:",{"$f":"'CONCILIACIÓN BANC.'!H8","v":"INGRESAR DATO"}]
[null,null,null,null,null," "]
[null,"MES:",{"$f":"'CONCILIACIÓN BANC.'!C10:D10","v":"DICIEMBRE"},null,"AÑO:",{"$f":"'CONCILIACIÓN BANC.'!H10","v":"2016"}]
[]
[null,"ANEXO 3 .-  DEPOSITOS NO CONSIDERADOS POR EL BANCO"]
[]
[]
[null,"FECHA","IMPORTE",null,"FECHA","IMPORTE"]
[]
[]
[]
[]
[]
[]
[]
[]
[]
[]
[]
[]
[]
[]
[]
[]
[]
[]
[]
[]
[]
[]
[]
[]
[]
[]
[]
[]
[]
[null,"SUMA:",{"$f":"SUM(C15:C43)","v":0},null,"SUMA:",{"$f":"SUM(F15:F43)","v":0}]

{"sheet":"ANEXO 4 ","index":6,"n_rows":44,"n_cols":6,"rows_kept":44,"cut":false,"hidden":true,"merged":[[33,3,33,4],[22,3,22,4],[28,3,28,4],[29,3,29,4],[30,3,30,4],[31,3,31,4],[32,3,32,4],[23,3,23,4],[24,3,24,4],[25,3,25,4],[26,3,26,4],[27,3,27,4],[40,3,40,4],[41,3,41,4],[34,3,34,4],[35,3,35,4],[36,3,36,4],[37,3,37,4],[38,3,38,4],[39,3,39,4],[2,1,2,3],[4,1,4,3],[21,3,21,4],[13,3,13,4],[14,3,14,4],[15,3,15,4],[10,1,11,5],[16,3,16,4],[17,3,17,4],[18,3,18,4],[19,3,19,4],[20,3,20,4],[6,2,6,3],[8,2,8,3]]}
[]
[]
[null,"CONCILIACION BANCARIA",null,null,"CONAC",{"$f":"'CONCILIACIÓN BANC.'!I4","v":"ERROR"}]
[]
[null,{"$f":"'CONCILIACIÓN BANC.'!B6:E6","v":"OFICINA OPERADORA: SELECCIÓN"},null,null,"No. AUXILIAR:",{"$f":"'CONCILIACIÓN BANC.'!H6","v":"INGRESAR DATO"}]
[]
[null,"BANCO:",{"$f":"'CONCILIACIÓN BANC.'!C8","v":"ERROR"},null,"No. CTA/CLABE:",{"$f":"'CONCILIACIÓN BANC.'!H8","v":"INGRESAR DATO"}]
[null,null,null,null,null," "]
[null,"MES:",{"$f":"'CONCILIACIÓN BANC.'!C10:D10","v":"DICIEMBRE"},null,"AÑO:",{"$f":"'CONCILIACIÓN BANC.'!H10","v":"2016"}]
[]
[null,"ANEXO 4 .-  CHEQUES AÚN NO PAGADOS POR EL BANCO"]
[]
[]
[null,"FECHA","Nº DE CHEQUE","BENEFICIARIO",null,"IMPORTE"]
[null,null,null,null,null,500]
[]
[]
[]
[]
[]
[]
[]
[]
[]
[]
[]
[]
[]
[]
[]
[]
[]
[]
[]
[]
[]
[]
[]
[]
[]
[]
[]
[]
[null,null,"SUMA:",null,null,{"$f":"SUM(F15:F42)","v":500}]

{"sheet":"ANEXO 5","index":7,"n_rows":44,"n_cols":7,"rows_kept":44,"cut":false,"hidden":true,"merged":[[2,1,2,4],[10,1,11,6],[4,1,4,4],[6,2,6,3],[8,2,8,3]]}
[]
[]
[null,"CONCILIACION BANCARIA",null,null,null,"CONAC",{"$f":"'CONCILIACIÓN BANC.'!I4","v":"ERROR"}]
[]
[null,{"$f":"'CONCILIACIÓN BANC.'!B6:E6","v":"OFICINA OPERADORA: SELECCIÓN"},null,null,null,"No. AUXILIAR:",{"$f":"'CONCILIACIÓN BANC.'!H6","v":"INGRESAR DATO"}]
[]
[null,"BANCO:",{"$f":"'CONCILIACIÓN BANC.'!C8:D8","v":"ERROR"},null,null,"No. CTA/CLABE:",{"$f":"'CONCILIACIÓN BANC.'!H8","v":"INGRESAR DATO"}]
[null,null,null,null,null,null," "]
[null,"MES:",{"$f":"'CONCILIACIÓN BANC.'!C10:D10","v":"DICIEMBRE"},null,null,"AÑO:",{"$f":"'CONCILIACIÓN BANC.'!H10","v":"2016"}]
[]
[null,"ANEXO 5 .-  CARGOS Y/O ABONOS EFECTUADOS POR EL BANCO NO CORRESPONDIENTES A LA CUENTA EN PROCESO"]
[]
[]
[null,"FECHA","Nº DE CHEQUE Y/O CARGO","IMPORTE","FECHA","DEPÓSITO Y/O ABONO","IMPORTE"]
[]
[]
[]
[]
[]
[]
[]
[]
[]
[]
[]
[]
[]
[]
[]
[]
[]
[]
[]
[]
[]
[]
[]
[]
[]
[]
[]
[]
[]
[null,null,"SUMA:",{"$f":"SUM(D15:D42)","v":0},null,"SUMA:",{"$f":"SUM(G15:G42)","v":0}]