{"text_format":"1","workbook":"xlsx","n_sheets":8,"sheets":["DATOS","Hoja1","CONCILIACIÓN BANC.","ANEXO 1","ANEXO 2","ANEXO 3","ANEXO 4 ","ANEXO 5"],"not_rendered":{"charts":0,"images":1,"macros":1,"external_links":0,"defined_names":0,"comments":1,"pivot_tables":0},"unopened":[],"bounds":{"document_bytes":16777216,"sheet_cells":100000,"rows_first":2000,"rows_last":500,"rows_between":2000,"halvings":0,"cell_chars":16384,"cell_head_chars":4096},"cells_cut":0,"cells_raw":0,"read":"whole","date_system":"1900"}

{"sheet":"DATOS","index":0,"n_rows":89,"n_cols":12,"rows_kept":89,"cut":false,"hidden":false,"merged":[[1,2,4,10]]}
[]
[null,null,"IMPORTANTE INGRESAR TODOS LOS DATOS, PARA QUE LA CONCILIACIÓN NO GENERE ERRORES"]
[]
[]
[]
[null,null,"DATOS",null,null,null,null,null,null,null,"PERIODO","E"]
[null,null,"OFICINA OPERDORA",null,null,null,null,null,null,null,"MES"]
[null,"A","SELECCIÓN",null,null,null,null,null,null,null,"DICIEMBRE"]
[null,null,"AUXILIAR",null,null,null,null,null,null,null,"AÑO"]
[null,"B",null,"ERROR",null,null,null,null,null,null,"2016"]
[null,null,"CONAC"]
[null,"C","1001-2131",{"$f":"IFERROR(IF(MATCH(C12,F14:F37,0)>0,\"\",\"\"),\"ERROR\")","v":"ERROR"},"FILA INICIAL",{"$f":"MATCH(C8,Tabla1[OFICINA],0)","v":{"$error":"#N/A"}},"FILA FINAL",{"$f":"MATCH(LOOKUP(C8,Tabla1[OFICINA],Tabla1[OFICINA]),Tabla1[OFICINA])","v":195}]
[null,null,"BANCO",null,null,"CONAC"]
[null,null,{"$f":"IFERROR(INDEX(F14:G37,MATCH(C12,F14:F37,0),2),\"\")","v":""},null,{"$f":"F12","v":{"$error":"#N/A"}},{"$f":"IFERROR(IF(E14=0,\"\",INDEX(Tabla1[],E14,3)),\"\")","v":""},{"$f":"IFERROR(IF(E14=0,\"\",INDEX(Tabla1[],E14,5)),\"\")","v":""},null,null,"SELECCIÓN"]
[null,null,"No. DE CUENTA",null,{"$f":"IFERROR(IF((E14+1)<=$H$12,E14+1,\"\"),\"\")","v":""},{"$f":"IFERROR(IF(E15=0,\"\",INDEX(Tabla1[],E15,3)),\"\")","v":""},{"$f":"IFERROR(IF(E15=0,\"\",INDEX(Tabla1[],E15,5)),\"\")","v":""},null,null,"ACAYUCAN"]
[null,"D",null,"ERROR",{"$f":"IFERROR(IF((E15+1)<=$H$12,E15+1,\"\"),\"\")","v":""},{"$f":"IFERROR(IF(E16=0,\"\",INDEX(Tabla1[],E16,3)),\"\")","v":""},{"$f":"IFERROR(IF(E16=0,\"\",INDEX(Tabla1[],E16,5)),\"\")","v":""},null,null,"AGUA DULCE"]
[null,null,null,null,"",{"$f":"IFERROR(IF(E17=0,\"\",INDEX(Tabla1[],E17,3)),\"\")","v":""},{"$f":"IFERROR(IF(E17=0,\"\",INDEX(Tabla1[],E17,5)),\"\")","v":""},null,null,"ÁLAMO"]
[null,null,null,null,"",{"$f":"IFERROR(IF(E18=0,\"\",INDEX(Tabla1[],E18,3)),\"\")","v":""},{"$f":"IFERROR(IF(E18=0,\"\",INDEX(Tabla1[],E18,5)),\"\")","v":""},null,null,"ALTOTONGA"]
[null,null,null,null,"",{"$f":"IFERROR(IF(E19=0,\"\",INDEX(Tabla1[],E19,3)),\"\")","v":""},{"$f":"IFERROR(IF(E19=0,\"\",INDEX(Tabla1[],E19,5)),\"\")","v":""},null,null,"ALVARADO"]
[null,null,null,null,"",{"$f":"IFERROR(IF(E20=0,\"\",INDEX(Tabla1[],E20,3)),\"\")","v":""},{"$f":"IFERROR(IF(E20=0,\"\",INDEX(Tabla1[],E20,5)),\"\")","v":""},null,null,"ÁNGEL R. CABADA"]
[null,null,null,null,"",{"$f":"IFERROR(IF(E21=0,\"\",INDEX(Tabla1[],E21,3)),\"\")","v":""},{"$f":"IFERROR(IF(E21=0,\"\",INDEX(Tabla1[],E21,5)),\"\")","v":""},null,null,"ARROYO AZUL"]
[null,null,null,null,"",{"$f":"IFERROR(IF(E22=0,\"\",INDEX(Tabla1[],E22,3)),\"\")","v":""},{"$f":"IFERROR(IF(E22=0,\"\",INDEX(Tabla1[],E22,5)),\"\")","v":""},null,null,"CARLOS A. CARRILLO"]
[null,null,null,null,"",{"$f":"IFERROR(IF(E23=0,\"\",INDEX(Tabla1[],E23,3)),\"\")","v":""},{"$f":"IFERROR(IF(E23=0,\"\",INDEX(Tabla1[],E23,5)),\"\")","v":""},null,null,"CASTILLO DE TEAYO "]
[null,null,null,null,"",{"$f":"IFERROR(IF(E24=0,\"\",INDEX(Tabla1[],E24,3)),\"\")","v":""},{"$f":"IFERROR(IF(E24=0,\"\",INDEX(Tabla1[],E24,5)),\"\")","v":""},null,null,"CATEMACO"]
[null,null,null,null,"",{"$f":"IFERROR(IF(E25=0,\"\",INDEX(Tabla1[],E25,3)),\"\")","v":""},{"$f":"IFERROR(IF(E25=0,\"\",INDEX(Tabla1[],E25,5)),\"\")","v":""},null,null,"CAZONES"]
[null,null,null,null,"",{"$f":"IFERROR(IF(E26=0,\"\",INDEX(Tabla1[],E26,3)),\"\")","v":""},{"$f":"IFERROR(IF(E26=0,\"\",INDEX(Tabla1[],E26,5)),\"\")","v":""},null,null,"CD. ALEMÁN"]
[null,null,null,null,"",{"$f":"IFERROR(IF(E27=0,\"\",INDEX(Tabla1[],E27,3)),\"\")","v":""},{"$f":"IFERROR(IF(E27=0,\"\",INDEX(Tabla1[],E27,5)),\"\")","v":""},null,null,"CD. CUAÚHTEMOC"]
[null,null,null,null,"",{"$f":"IFERROR(IF(E28=0,\"\",INDEX(Tabla1[],E28,3)),\"\")","v":""},{"$f":"IFERROR(IF(E28=0,\"\",INDEX(Tabla1[],E28,5)),\"\")","v":""},null,null,"CD. MENDOZA"]
[null,null,null,null,"",{"$f":"IFERROR(IF(E29=0,\"\",INDEX(Tabla1[],E29,3)),\"\")","v":""},{"$f":"IFERROR(IF(E29=0,\"\",INDEX(Tabla1[],E29,5)),\"\")","v":""},null,null,"CERRO AZUL"]
[null,null,null,null,"",{"$f":"IFERROR(IF(E30=0,\"\",INDEX(Tabla1[],E30,3)),\"\")","v":""},{"$f":"IFERROR(IF(E30=0,\"\",INDEX(Tabla1[],E30,5)),\"\")","v":""},null,null,"CHACALTIANGUIS"]
[null,null,null,null,"",{"$f":"IFERROR(IF(E31=0,\"\",INDEX(Tabla1[],E31,3)),\"\")","v":""},{"$f":"IFERROR(IF(E31=0,\"\",INDEX(Tabla1[],E31,5)),\"\")","v":""},null,null,"CHICHICAXTLE"]
[null,null,null,null,"",{"$f":"IFERROR(IF(E32=0,\"\",INDEX(Tabla1[],E32,3)),\"\")","v":""},{"$f":"IFERROR(IF(E32=0,\"\",INDEX(Tabla1[],E32,5)),\"\")","v":""},null,null,"CHICONTEPEC"]
[null,null,null,null,"",{"$f":"IFERROR(IF(E33=0,\"\",INDEX(Tabla1[],E33,3)),\"\")","v":""},{"$f":"IFERROR(IF(E33=0,\"\",INDEX(Tabla1[],E33,5)),\"\")","v":""},null,null,"CHINAMECA"]
[null,null,null,null,"",{"$f":"IFERROR(IF(E34=0,\"\",INDEX(Tabla1[],E34,3)),\"\")","v":""},{"$f":"IFERROR(IF(E34=0,\"\",INDEX(Tabla1[],E34,5)),\"\")","v":""},null,null,"COATZACOALCOS"]
[null,null,null,null,"",{"$f":"IFERROR(IF(E35=0,\"\",INDEX(Tabla1[],E35,3)),\"\")","v":""},{"$f":"IFERROR(IF(E35=0,\"\",INDEX(Tabla1[],E35,5)),\"\")","v":""},null,null,"COATZINTLA"]
[null,null,null,null,"",{"$f":"IFERROR(IF(E36=0,\"\",INDEX(Tabla1[],E36,3)),\"\")","v":""},{"$f":"IFERROR(IF(E36=0,\"\",INDEX(Tabla1[],E36,5)),\"\")","v":""},null,null,"COSAMALOAPAN"]
[null,null,null,null,"",{"$f":"IFERROR(IF(E37=0,\"\",INDEX(Tabla1[],E37,3)),\"\")","v":""},{"$f":"IFERROR(IF(E37=0,\"\",INDEX(Tabla1[],E37,5)),\"\")","v":""},null,null,"COSOLEACAQUE"]
[null,null,null,null,null,null,null,null,null,"CUITLAHUAC"]
[null,null,null,null,null,null,null,null,null,"EL HIGO"]
[null,null,null,null,null,null,null,null,null,"EMILIO CARRANZA"]
[null,null,null,null,null,null,null,null,null,"GUTIÉRREZ ZAMORA"]
[null,null,null,null,null,null,null,null,null,"IGNACIO DE LA LLAVE"]
[null,null,null,null,null,null,null,null,null,"ISLA"]
[null,null,null,null,null,null,null,null,null,"IXHUATLÁN DEL CAFÉ"]
[null,null,null,null,null,null,null,null,null,"IXHUATLÁN DEL SURESTE"]
[null,null,null,null,null,null,null,null,null,"JALACINGO"]
[null,null,null,null,null,null,null,null,null,"JESÚS CARRANZA"]
[null,null,null,null,null,null,null,null,null,"JUAN DÍAZ COVARRUBIAS"]
[null,null,null,null,null,null,null,null,null,"JUAN RODRÍGUEZ CLARA"]
[null,null,null,null,null,null,null,null,null,"LAS CHOAPAS"]
[null,null,null,null,null,null,null,null,null,"LAS VIGAS"]
[null,null,null,null,null,null,null,null,null,"MALTRATA"]
[null,null,null,null,null,null,null,null,null,"MARTÍNEZ DE LA TORRE"]
[null,null,null,null,null,null,null,null,null,"MINATITLÁN"]
[null,null,null,null,null,null,null,null,null,"MISANTLA"]
[null,null,null,null,null,null,null,null,null,"NANCHITAL"]
[null,null,null,null,null,null,null,null,null,"NARANJOS"]
[null,null,null,null,null,null,null,null,null,"NOGALES"]
[null,null,null,null,null,null,null,null,null,"OFICINAS CENTRALES"]
[null,null,null,null,null,null,null,null,null,"OTATITLÁN"]
[null,null,null,null,null,null,null,null,null,"PÁNUCO"]
[null,null,null,null,null,null,null,null,null,"PAPANTLA"]
[null,null,null,null,null,null,null,null,null,"PASO DEL MACHO"]
[null,null,null,null,null,null,null,null,null,"PEÑUELA"]
[null,null,null,null,null,null,null,null,null,"PEROTE"]
[null,null,null,null,null,null,null,null,null,"PIEDRAS NEGRAS"]
[null,null,null,null,null,null,null,null,null,"PLATÓN SÁNCHEZ"]
[null,null,null,null,null,null,null,null,null,"PLAYA VICENTE"]
[null,null,null,null,null,null,null,null,null,"POZA RICA"]
[null,null,null,null,null,null,null,null,null,"RÍO BLANCO"]
[null,null,null,null,null,null,null,null,null,"SALTABARRANCA"]
[null,null,null,null,null,null,null,null,null,"SANTIAGO TUXTLA"]
[null,null,null,null,null,null,null,null,null,"SAYULA DE ALEMAN"]
[null,null,null,null,null,null,null,null,null,"SOLEDAD DE DOBLADO"]
[null,null,null,null,null,null,null,null,null,"TANTOYUCA"]
[null,null,null,null,null,null,null,null,null,"TEMPOAL "]
[null,null,null,null,null,null,null,null,null,"TEPETZINTLA"]
[null,null,null,null,null,null,null,null,null,"TEZONAPA"]
[null,null,null,null,null,null,null,null,null,"TLACOTALPAN"]
[null,null,null,null,null,null,null,null,null,"TLALIXCOYAN"]
[null,null,null,null,null,null,null,null,null,"TLALTETELA "]
[null,null,null,null,null,null,null,null,null,"TLAPACOYAN"]
[null,null,null,null,null,null,null,null,null,"TOMATLÁN"]
[null,null,null,null,null,null,null,null,null,"TRES VALLLES"]
[null,null,null,null,null,null,null,null,null,"TUXPAN"]
[null,null,null,null,null,null,null,null,null,"VEGA DE ALATORRE"]
[null,null,null,null,null,null,null,null,null,"VILLA AZUETA"]
[null,null,null,null,null,null,null,null,null,"XICO"]
[null,null,null,null,null,null,null,null,null,"YANGA"]

{"sheet":"Hoja1","index":1,"n_rows":229,"n_cols":7,"rows_kept":229,"cut":false,"hidden":true,"merged":[]}
["NIVEL5","NIVEL6","CONAC","AUXILIAR","BANCO","CUENTA","OFICINA"]
[1001,2061,{"$f":"CONCATENATE(Tabla1[[#This Row],[NIVEL5]],\"-\",Tabla1[[#This Row],[NIVEL6]])","v":"1001-2061"},5820015,"BBVA BANCOMER, S.A.","0181216716","ACAYUCAN"]
[1001,2111,{"$f":"CONCATENATE(Tabla1[[#This Row],[NIVEL5]],\"-\",Tabla1[[#This Row],[NIVEL6]])","v":"1001-2111"},5820018,"BBVA BANCOMER, S.A.","0193390268","ACAYUCAN"]
[1003,2024,{"$f":"CONCATENATE(Tabla1[[#This Row],[NIVEL5]],\"-\",Tabla1[[#This Row],[NIVEL6]])","v":"1003-2024"},5820016,"SANTANDER, S.A.","65503091442","ACAYUCAN"]
[1003,2037,{"$f":"CONCATENATE(Tabla1[[#This Row],[NIVEL5]],\"-\",Tabla1[[#This Row],[NIVEL6]])","v":"1003-2037"},5820017,"SANTANDER, S.A.","65503374360","ACAYUCAN"]
[1004,2007,{"$f":"CONCATENATE(Tabla1[[#This Row],[NIVEL5]],\"-\",Tabla1[[#This Row],[NIVEL6]])","v":"1004-2007"},5820002,"SCOTIABANK  INVERLAT","07000373486","ACAYUCAN"]
[1004,2029,{"$f":"CONCATENATE(Tabla1[[#This Row],[NIVEL5]],\"-\",Tabla1[[#This Row],[NIVEL6]])","v":"1004-2029"},5820019,"SCOTIABANK  INVERLAT","07000550493","ACAYUCAN"]
[1008,2001,{"$f":"CONCATENATE(Tabla1[[#This Row],[NIVEL5]],\"-\",Tabla1[[#This Row],[NIVEL6]])","v":"1008-2001"},5820007,"AZTECA","30840143523719","ACAYUCAN"]
[1001,2063,{"$f":"CONCATENATE(Tabla1[[#This Row],[NIVEL5]],\"-\",Tabla1[[#This Row],[NIVEL6]])","v":"1001-2063"},5870003,"BBVA BANCOMER, S.A.","0181218654","AGUA DULCE"]
[1001,2139,{"$f":"CONCATENATE(Tabla1[[#This Row],[NIVEL5]],\"-\",Tabla1[[#This Row],[NIVEL6]])","v":"1001-2139"},5870005,"BBVA BANCOMER, S.A.",100956457,"AGUA DULCE"]
[1003,2072,{"$f":"CONCATENATE(Tabla1[[#This Row],[NIVEL5]],\"-\",Tabla1[[#This Row],[NIVEL6]])","v":"1003-2072"},5870004,"SANTANDER, S.A.","65504465118","AGUA DULCE"]
[1001,2036,{"$f":"CONCATENATE(Tabla1[[#This Row],[NIVEL5]],\"-\",Tabla1[[#This Row],[NIVEL6]])","v":"1001-2036"},5040004,"BBVA BANCOMER, S.A.","0181200267","ÁLAMO"]
[1001,2131,{"$f":"CONCATENATE(Tabla1[[#This Row],[NIVEL5]],\"-\",Tabla1[[#This Row],[NIVEL6]])","v":"1001-2131"},5040007,"BBVA BANCOMER, S.A.",100956716,"ÁLAMO"]
[1003,2073,{"$f":"CONCATENATE(Tabla1[[#This Row],[NIVEL5]],\"-\",Tabla1[[#This Row],[NIVEL6]])","v":"1003-2073"},5040006,"SANTANDER, S.A.","655037481777","ÁLAMO"]
[1001,2006,{"$f":"CONCATENATE(Tabla1[[#This Row],[NIVEL5]],\"-\",Tabla1[[#This Row],[NIVEL6]])","v":"1001-2006"},180002,"BBVA BANCOMER, S.A.","0181105795","ALTOTONGA"]
[1001,2146,{"$f":"CONCATENATE(Tabla1[[#This Row],[NIVEL5]],\"-\",Tabla1[[#This Row],[NIVEL6]])","v":"1001-2146"},180004,"BBVA BANCOMER, S.A.",100956988,"ALTOTONGA"]
[1003,2063,{"$f":"CONCATENATE(Tabla1[[#This Row],[NIVEL5]],\"-\",Tabla1[[#This Row],[NIVEL6]])","v":"1003-2063"},180003,"SANTANDER, S.A.","800057627692","ALTOTONGA"]
[1003,2057,{"$f":"CONCATENATE(Tabla1[[#This Row],[NIVEL5]],\"-\",Tabla1[[#This Row],[NIVEL6]])","v":"1003-2057"},5530003,"SANTANDER, S.A.","65502922576","ALVARADO"]
[1003,2058,{"$f":"CONCATENATE(Tabla1[[#This Row],[NIVEL5]],\"-\",Tabla1[[#This Row],[NIVEL6]])","v":"1003-2058"},5530004,"SANTANDER, S.A.","92001813262","ALVARADO"]
[1005,2013,{"$f":"CONCATENATE(Tabla1[[#This Row],[NIVEL5]],\"-\",Tabla1[[#This Row],[NIVEL6]])","v":"1005-2013"},5530001,"HSBC","4050433622","ALVARADO"]
[1005,2014,{"$f":"CONCATENATE(Tabla1[[#This Row],[NIVEL5]],\"-\",Tabla1[[#This Row],[NIVEL6]])","v":"1005-2014"},5530002,"HSBC","4051738524","ALVARADO"]
[1005,2015,{"$f":"CONCATENATE(Tabla1[[#This Row],[NIVEL5]],\"-\",Tabla1[[#This Row],[NIVEL6]])","v":"1005-2015"},5530005,"HSBC","4056680200","ALVARADO"]
[1001,2057,{"$f":"CONCATENATE(Tabla1[[#This Row],[NIVEL5]],\"-\",Tabla1[[#This Row],[NIVEL6]])","v":"1001-2057"},5760002,"BBVA BANCOMER, S.A.","0442099527","ÁNGEL R. CABADA"]
[1001,2058,{"$f":"CONCATENATE(Tabla1[[#This Row],[NIVEL5]],\"-\",Tabla1[[#This Row],[NIVEL6]])","v":"1001-2058"},5760003,"BBVA BANCOMER, S.A.","0159003312","ÁNGEL R. CABADA"]
[1001,2083,{"$f":"CONCATENATE(Tabla1[[#This Row],[NIVEL5]],\"-\",Tabla1[[#This Row],[NIVEL6]])","v":"1001-2083"},5760005,"BBVA BANCOMER, S.A.","0181197673","ÁNGEL R. CABADA"]
[1001,2148,{"$f":"CONCATENATE(Tabla1[[#This Row],[NIVEL5]],\"-\",Tabla1[[#This Row],[NIVEL6]])","v":"1001-2148"},5760006,"BBVA BANCOMER, S.A.",100957372,"ÁNGEL R. CABADA"]
[1006,2015,{"$f":"CONCATENATE(Tabla1[[#This Row],[NIVEL5]],\"-\",Tabla1[[#This Row],[NIVEL6]])","v":"1006-2015"},5760001,"BANORTE, S.A.","0149298102","ÁNGEL R. CABADA"]
[1004,2010,{"$f":"CONCATENATE(Tabla1[[#This Row],[NIVEL5]],\"-\",Tabla1[[#This Row],[NIVEL6]])","v":"1004-2010"},9000027,"SCOTIABANK  INVERLAT","5905274451","ARROYO AZUL"]
[1003,2079,{"$f":"CONCATENATE(Tabla1[[#This Row],[NIVEL5]],\"-\",Tabla1[[#This Row],[NIVEL6]])","v":"1003-2079"},1400003,"SANTANDER, S.A.","65505281831","CARLOS A. CARRILLO"]
[1003,2081,{"$f":"CONCATENATE(Tabla1[[#This Row],[NIVEL5]],\"-\",Tabla1[[#This Row],[NIVEL6]])","v":"1003-2081"},1400004,"SANTANDER, S.A.","65505016979","CARLOS A. CARRILLO"]
[1003,2029,{"$f":"CONCATENATE(Tabla1[[#This Row],[NIVEL5]],\"-\",Tabla1[[#This Row],[NIVEL6]])","v":"1003-2029"},9000043,"SANTANDER, S.A.","92001809559","CASTILLO DE TEAYO "]
[1001,2049,{"$f":"CONCATENATE(Tabla1[[#This Row],[NIVEL5]],\"-\",Tabla1[[#This Row],[NIVEL6]])","v":"1001-2049"},5430003,"BBVA BANCOMER, S.A.","0181192655","CATEMACO"]
[1001,2118,{"$f":"CONCATENATE(Tabla1[[#This Row],[NIVEL5]],\"-\",Tabla1[[#This Row],[NIVEL6]])","v":"1001-2118"},5430004,"BBVA BANCOMER, S.A.",100958301,"CATEMACO"]
[1001,2022,{"$f":"CONCATENATE(Tabla1[[#This Row],[NIVEL5]],\"-\",Tabla1[[#This Row],[NIVEL6]])","v":"1001-2022"},520002,"BBVA BANCOMER, S.A.","00181223534","CAZONES"]
[1001,2150,{"$f":"CONCATENATE(Tabla1[[#This Row],[NIVEL5]],\"-\",Tabla1[[#This Row],[NIVEL6]])","v":"1001-2150"},520003,"BBVA BANCOMER, S.A.",100976571,"CAZONES"]
[1003,2011,{"$f":"CONCATENATE(Tabla1[[#This Row],[NIVEL5]],\"-\",Tabla1[[#This Row],[NIVEL6]])","v":"1003-2011"},2220003,"SANTANDER, S.A.","92001602403","CD. ALEMÁN"]
[1003,2083,{"$f":"CONCATENATE(Tabla1[[#This Row],[NIVEL5]],\"-\",Tabla1[[#This Row],[NIVEL6]])","v":"1003-2083"},2220004,"SANTANDER, S.A.","65505020509","CD. ALEMÁN"]
[1003,2084,{"$f":"CONCATENATE(Tabla1[[#This Row],[NIVEL5]],\"-\",Tabla1[[#This Row],[NIVEL6]])","v":"1003-2084"},2220005,"SANTANDER, S.A.","65505706314","CD. ALEMÁN"]
[1003,2018,{"$f":"CONCATENATE(Tabla1[[#This Row],[NIVEL5]],\"-\",Tabla1[[#This Row],[NIVEL6]])","v":"1003-2018"},5510001,"SANTANDER, S.A.","92000353888","CD. CUAÚHTEMOC"]
[1003,2019,{"$f":"CONCATENATE(Tabla1[[#This Row],[NIVEL5]],\"-\",Tabla1[[#This Row],[NIVEL6]])","v":"1003-2019"},5510002,"SANTANDER, S.A.","65502013262","CD. CUAÚHTEMOC"]
[1003,2020,{"$f":"CONCATENATE(Tabla1[[#This Row],[NIVEL5]],\"-\",Tabla1[[#This Row],[NIVEL6]])","v":"1003-2020"},5510003,"SANTANDER, S.A.","92001390610","CD. CUAÚHTEMOC"]
[1005,2016,{"$f":"CONCATENATE(Tabla1[[#This Row],[NIVEL5]],\"-\",Tabla1[[#This Row],[NIVEL6]])","v":"1005-2016"},5560003,"HSBC","021852040564630378","CD. MENDOZA"]
[1001,2067,{"$f":"CONCATENATE(Tabla1[[#This Row],[NIVEL5]],\"-\",Tabla1[[#This Row],[NIVEL6]])","v":"1001-2067"},5960002,"BBVA BANCOMER, S.A.","0181220217","CERRO AZUL"]
[1001,2115,{"$f":"CONCATENATE(Tabla1[[#This Row],[NIVEL5]],\"-\",Tabla1[[#This Row],[NIVEL6]])","v":"1001-2115"},5960007,"BBVA BANCOMER, S.A.",198029466,"CERRO AZUL"]
[1001,2123,{"$f":"CONCATENATE(Tabla1[[#This Row],[NIVEL5]],\"-\",Tabla1[[#This Row],[NIVEL6]])","v":"1001-2123"},5960008,"BBVA BANCOMER, S.A.",100958360,"CERRO AZUL"]
[1002,2024,{"$f":"CONCATENATE(Tabla1[[#This Row],[NIVEL5]],\"-\",Tabla1[[#This Row],[NIVEL6]])","v":"1002-2024"},5960006,"BANAMEX, S.A.","1812990","CERRO AZUL"]
[1003,2047,{"$f":"CONCATENATE(Tabla1[[#This Row],[NIVEL5]],\"-\",Tabla1[[#This Row],[NIVEL6]])","v":"1003-2047"},5960005,"SANTANDER, S.A.","65503748129","CERRO AZUL"]
[1003,2010,{"$f":"CONCATENATE(Tabla1[[#This Row],[NIVEL5]],\"-\",Tabla1[[#This Row],[NIVEL6]])","v":"1003-2010"},1420001,"SANTANDER, S.A.","92001178176","CHACALTIANGUIS"]
[1001,2015,{"$f":"CONCATENATE(Tabla1[[#This Row],[NIVEL5]],\"-\",Tabla1[[#This Row],[NIVEL6]])","v":"1001-2015"},420004,"BBVA BANCOMER, S.A.","0181282859","CHICHICAXTLE"]
[1001,2032,{"$f":"CONCATENATE(Tabla1[[#This Row],[NIVEL5]],\"-\",Tabla1[[#This Row],[NIVEL6]])","v":"1001-2032"},1440002,"BBVA BANCOMER, S.A.","0181282395","CHICONTEPEC"]
[1001,2121,{"$f":"CONCATENATE(Tabla1[[#This Row],[NIVEL5]],\"-\",Tabla1[[#This Row],[NIVEL6]])","v":"1001-2121"},1440003,"BBVA BANCOMER, S.A.",100958743,"CHICONTEPEC"]
[1001,2018,{"$f":"CONCATENATE(Tabla1[[#This Row],[NIVEL5]],\"-\",Tabla1[[#This Row],[NIVEL6]])","v":"1001-2018"},470002,"BBVA BANCOMER, S.A.","0181105442","CHINAMECA"]
[1001,2122,{"$f":"CONCATENATE(Tabla1[[#This Row],[NIVEL5]],\"-\",Tabla1[[#This Row],[NIVEL6]])","v":"1001-2122"},470003,"BBVA BANCOMER, S.A.",100959073,"CHINAMECA"]
[1001,2016,{"$f":"CONCATENATE(Tabla1[[#This Row],[NIVEL5]],\"-\",Tabla1[[#This Row],[NIVEL6]])","v":"1001-2016"},450013,"BBVA BANCOMER, S.A.","0180809179","COATZACOALCOS"]
[1001,2017,{"$f":"CONCATENATE(Tabla1[[#This Row],[NIVEL5]],\"-\",Tabla1[[#This Row],[NIVEL6]])","v":"1001-2017"},450014,"BBVA BANCOMER, S.A.","0184917200","COATZACOALCOS"]
[1002,2005,{"$f":"CONCATENATE(Tabla1[[#This Row],[NIVEL5]],\"-\",Tabla1[[#This Row],[NIVEL6]])","v":"1002-2005"},450012,"BANAMEX, S.A.","6600447","COATZACOALCOS"]
[1002,2006,{"$f":"CONCATENATE(Tabla1[[#This Row],[NIVEL5]],\"-\",Tabla1[[#This Row],[NIVEL6]])","v":"1002-2006"},450015,"BANAMEX, S.A.","2924362","COATZACOALCOS"]
[1002,2007,{"$f":"CONCATENATE(Tabla1[[#This Row],[NIVEL5]],\"-\",Tabla1[[#This Row],[NIVEL6]])","v":"1002-2007"},450018,"BANAMEX, S.A.","2842110","COATZACOALCOS"]
[1002,2008,{"$f":"CONCATENATE(Tabla1[[#This Row],[NIVEL5]],\"-\",Tabla1[[#This Row],[NIVEL6]])","v":"1002-2008"},450019,"BANAMEX, S.A.","28929526","COATZACOALCOS"]
[1002,2009,{"$f":"CONCATENATE(Tabla1[[#This Row],[NIVEL5]],\"-\",Tabla1[[#This Row],[NIVEL6]])","v":"1002-2009"},450020,"BANAMEX, S.A.","177906","COATZACOALCOS"]
[1002,2010,{"$f":"CONCATENATE(Tabla1[[#This Row],[NIVEL5]],\"-\",Tabla1[[#This Row],[NIVEL6]])","v":"1002-2010"},450021,"BANAMEX, S.A.","172775","COATZACOALCOS"]
[1002,2026,{"$f":"CONCATENATE(Tabla1[[#This Row],[NIVEL5]],\"-\",Tabla1[[#This Row],[NIVEL6]])","v":"1002-2026"},450025,"BANAMEX, S.A.","42382084","COATZACOALCOS"]
[1003,2001,{"$f":"CONCATENATE(Tabla1[[#This Row],[NIVEL5]],\"-\",Tabla1[[#This Row],[NIVEL6]])","v":"1003-2001"},450002,"SANTANDER, S.A.","65500814668","COATZACOALCOS"]
[1003,2002,{"$f":"CONCATENATE(Tabla1[[#This Row],[NIVEL5]],\"-\",Tabla1[[#This Row],[NIVEL6]])","v":"1003-2002"},450004,"SANTANDER, S.A.","51908104376","COATZACOALCOS"]
[1003,2003,{"$f":"CONCATENATE(Tabla1[[#This Row],[NIVEL5]],\"-\",Tabla1[[#This Row],[NIVEL6]])","v":"1003-2003"},450005,"SANTANDER, S.A.","51908145116","COATZACOALCOS"]
[1003,2004,{"$f":"CONCATENATE(Tabla1[[#This Row],[NIVEL5]],\"-\",Tabla1[[#This Row],[NIVEL6]])","v":"1003-2004"},450006,"SANTANDER, S.A.","65500813599","COATZACOALCOS"]
[1003,2005,{"$f":"CONCATENATE(Tabla1[[#This Row],[NIVEL5]],\"-\",Tabla1[[#This Row],[NIVEL6]])","v":"1003-2005"},450007,"SANTANDER, S.A.","65500813600","COATZACOALCOS"]
[1003,2055,{"$f":"CONCATENATE(Tabla1[[#This Row],[NIVEL5]],\"-\",Tabla1[[#This Row],[NIVEL6]])","v":"1003-2055"},450023,"SANTANDER, S.A.","65503938451","COATZACOALCOS"]
[1003,2077,{"$f":"CONCATENATE(Tabla1[[#This Row],[NIVEL5]],\"-\",Tabla1[[#This Row],[NIVEL6]])","v":"1003-2077"},420024,"SANTANDER, S.A.","65505109209","COATZACOALCOS"]
[1009,2001,{"$f":"CONCATENATE(Tabla1[[#This Row],[NIVEL5]],\"-\",Tabla1[[#This Row],[NIVEL6]])","v":"1009-2001"},450003,"NACIONAL DEL EJEC.","0892000112","COATZACOALCOS"]
[1001,2001,{"$f":"CONCATENATE(Tabla1[[#This Row],[NIVEL5]],\"-\",Tabla1[[#This Row],[NIVEL6]])","v":"1001-2001"},60004,"BBVA BANCOMER, S.A.","0181221868","COATZINTLA"]
[1001,2002,{"$f":"CONCATENATE(Tabla1[[#This Row],[NIVEL5]],\"-\",Tabla1[[#This Row],[NIVEL6]])","v":"1001-2002"},60005,"BBVA BANCOMER, S.A.","0189718540","COATZINTLA"]
[1001,2147,{"$f":"CONCATENATE(Tabla1[[#This Row],[NIVEL5]],\"-\",Tabla1[[#This Row],[NIVEL6]])","v":"1001-2147"},60007,"BBVA BANCOMER, S.A.",100959251,"COATZINTLA"]
[1003,2054,{"$f":"CONCATENATE(Tabla1[[#This Row],[NIVEL5]],\"-\",Tabla1[[#This Row],[NIVEL6]])","v":"1003-2054"},60006,"SANTANDER, S.A.","65503748285","COATZINTLA"]
[1006,2001,{"$f":"CONCATENATE(Tabla1[[#This Row],[NIVEL5]],\"-\",Tabla1[[#This Row],[NIVEL6]])","v":"1006-2001"},60003,"BANORTE, S.A.","00560550357","COATZINTLA"]
[1006,2019,{"$f":"CONCATENATE(Tabla1[[#This Row],[NIVEL5]],\"-\",Tabla1[[#This Row],[NIVEL6]])","v":"1006-2019"},9000037,"BANORTE, S.A.","6572785584","COATZINTLA"]
[1003,2016,{"$f":"CONCATENATE(Tabla1[[#This Row],[NIVEL5]],\"-\",Tabla1[[#This Row],[NIVEL6]])","v":"1003-2016"},5300004,"SANTANDER, S.A.","92001662139","COSAMALOAPAN"]
[1003,2051,{"$f":"CONCATENATE(Tabla1[[#This Row],[NIVEL5]],\"-\",Tabla1[[#This Row],[NIVEL6]])","v":"1003-2051"},5300008,"SANTANDER, S.A.","65503748422","COSAMALOAPAN"]
[1001,2052,{"$f":"CONCATENATE(Tabla1[[#This Row],[NIVEL5]],\"-\",Tabla1[[#This Row],[NIVEL6]])","v":"1001-2052"},5460002,"BBVA BANCOMER, S.A.","0181280643","COSOLEACAQUE"]
[1001,2136,{"$f":"CONCATENATE(Tabla1[[#This Row],[NIVEL5]],\"-\",Tabla1[[#This Row],[NIVEL6]])","v":"1001-2136"},5460004,"BBVA BANCOMER, S.A.",100974862,"COSOLEACAQUE"]
[1003,2052,{"$f":"CONCATENATE(Tabla1[[#This Row],[NIVEL5]],\"-\",Tabla1[[#This Row],[NIVEL6]])","v":"1003-2052"},5460003,"SANTANDER, S.A.","65503748484","COSOLEACAQUE"]
[1004,2001,{"$f":"CONCATENATE(Tabla1[[#This Row],[NIVEL5]],\"-\",Tabla1[[#This Row],[NIVEL6]])","v":"1004-2001"},250001,"SCOTIABANK  INVERLAT","514640","CUITLAHUAC"]
[1001,2003,{"$f":"CONCATENATE(Tabla1[[#This Row],[NIVEL5]],\"-\",Tabla1[[#This Row],[NIVEL6]])","v":"1001-2003"},80002,"BBVA BANCOMER, S.A.","00181283774","EL HIGO"]
[1005,2017,{"$f":"CONCATENATE(Tabla1[[#This Row],[NIVEL5]],\"-\",Tabla1[[#This Row],[NIVEL6]])","v":"1005-2017"},80003,"HSBC","4057959751","EL HIGO"]
[1001,2117,{"$f":"CONCATENATE(Tabla1[[#This Row],[NIVEL5]],\"-\",Tabla1[[#This Row],[NIVEL6]])","v":"1001-2117"},320004,"BBVA BANCOMER, S.A.",100714232,"EMILIO CARRANZA"]
[1006,2004,{"$f":"CONCATENATE(Tabla1[[#This Row],[NIVEL5]],\"-\",Tabla1[[#This Row],[NIVEL6]])","v":"1006-2004"},320002,"BANORTE, S.A.","00604515380","EMILIO CARRANZA"]
[1001,2065,{"$f":"CONCATENATE(Tabla1[[#This Row],[NIVEL5]],\"-\",Tabla1[[#This Row],[NIVEL6]])","v":"1001-2065"},5950002,"BBVA BANCOMER, S.A.","00162214784","GUTIÉRREZ ZAMORA"]
[1001,2066,{"$f":"CONCATENATE(Tabla1[[#This Row],[NIVEL5]],\"-\",Tabla1[[#This Row],[NIVEL6]])","v":"1001-2066"},5950004,"BBVA BANCOMER, S.A.","00172198231","GUTIÉRREZ ZAMORA"]
[1001,2144,{"$f":"CONCATENATE(Tabla1[[#This Row],[NIVEL5]],\"-\",Tabla1[[#This Row],[NIVEL6]])","v":"1001-2144"},5950007,"BBVA BANCOMER, S.A.",100959456,"GUTIÉRREZ ZAMORA"]
[1005,2008,{"$f":"CONCATENATE(Tabla1[[#This Row],[NIVEL5]],\"-\",Tabla1[[#This Row],[NIVEL6]])","v":"1005-2008"},9000011,"HSBC","4023393184","IGNACIO DE LA LLAVE"]
[1001,2056,{"$f":"CONCATENATE(Tabla1[[#This Row],[NIVEL5]],\"-\",Tabla1[[#This Row],[NIVEL6]])","v":"1001-2056"},5600002,"BBVA BANCOMER, S.A.","0165416566","ISLA"]
[1003,2021,{"$f":"CONCATENATE(Tabla1[[#This Row],[NIVEL5]],\"-\",Tabla1[[#This Row],[NIVEL6]])","v":"1003-2021"},5600001,"SANTANDER, S.A.","65500846088","ISLA"]
[1003,2062,{"$f":"CONCATENATE(Tabla1[[#This Row],[NIVEL5]],\"-\",Tabla1[[#This Row],[NIVEL6]])","v":"1003-2062"},5600003,"SANTANDER, S.A.","65503748498","ISLA"]
[1001,2012,{"$f":"CONCATENATE(Tabla1[[#This Row],[NIVEL5]],\"-\",Tabla1[[#This Row],[NIVEL6]])","v":"1001-2012"},290002,"BBVA BANCOMER, S.A.","0181285904","IXHUATLÁN DEL CAFÉ"]
[1001,2124,{"$f":"CONCATENATE(Tabla1[[#This Row],[NIVEL5]],\"-\",Tabla1[[#This Row],[NIVEL6]])","v":"1001-2124"},290003,"BBVA BANCOMER, S.A.",100959820,"IXHUATLÁN DEL CAFÉ"]
[1001,2024,{"$f":"CONCATENATE(Tabla1[[#This Row],[NIVEL5]],\"-\",Tabla1[[#This Row],[NIVEL6]])","v":"1001-2024"},690002,"BBVA BANCOMER, S.A.","0181173626","IXHUATLÁN DEL SURESTE"]
[1001,2128,{"$f":"CONCATENATE(Tabla1[[#This Row],[NIVEL5]],\"-\",Tabla1[[#This Row],[NIVEL6]])","v":"1001-2128"},690003,"BBVA BANCOMER, S.A.",100960012,"IXHUATLÁN DEL SURESTE"]
[1001,2008,{"$f":"CONCATENATE(Tabla1[[#This Row],[NIVEL5]],\"-\",Tabla1[[#This Row],[NIVEL6]])","v":"1001-2008"},190003,"BBVA BANCOMER, S.A.","0181172867","JALACINGO"]
[1001,2143,{"$f":"CONCATENATE(Tabla1[[#This Row],[NIVEL5]],\"-\",Tabla1[[#This Row],[NIVEL6]])","v":"1001-2143"},190004,"BBVA BANCOMER, S.A.",100970271,"JALACINGO"]
[1001,2021,{"$f":"CONCATENATE(Tabla1[[#This Row],[NIVEL5]],\"-\",Tabla1[[#This Row],[NIVEL6]])","v":"1001-2021"},500002,"BBVA BANCOMER, S.A.","0181078259","JESÚS CARRANZA"]
[1001,2135,{"$f":"CONCATENATE(Tabla1[[#This Row],[NIVEL5]],\"-\",Tabla1[[#This Row],[NIVEL6]])","v":"1001-2135"},500005,"BBVA BANCOMER, S.A.",100973610,"JESÚS CARRANZA"]
[1001,2029,{"$f":"CONCATENATE(Tabla1[[#This Row],[NIVEL5]],\"-\",Tabla1[[#This Row],[NIVEL6]])","v":"1001-2029"},850002,"BBVA BANCOMER, S.A.","0181173367","JUAN DÍAZ COVARRUBIAS"]
[1001,2078,{"$f":"CONCATENATE(Tabla1[[#This Row],[NIVEL5]],\"-\",Tabla1[[#This Row],[NIVEL6]])","v":"1001-2078"},9000038,"BBVA BANCOMER, S.A.","0183125874","JUAN DÍAZ COVARRUBIAS"]
[1001,2138,{"$f":"CONCATENATE(Tabla1[[#This Row],[NIVEL5]],\"-\",Tabla1[[#This Row],[NIVEL6]])","v":"1001-2138"},850003,"BBVA BANCOMER, S.A.",100973769,"JUAN DÍAZ COVARRUBIAS"]
[1003,2007,{"$f":"CONCATENATE(Tabla1[[#This Row],[NIVEL5]],\"-\",Tabla1[[#This Row],[NIVEL6]])","v":"1003-2007"},810001,"SANTANDER, S.A.","92000166807","JUAN RODRÍGUEZ CLARA"]
[1001,2060,{"$f":"CONCATENATE(Tabla1[[#This Row],[NIVEL5]],\"-\",Tabla1[[#This Row],[NIVEL6]])","v":"1001-2060"},5790004,"BBVA BANCOMER, S.A.","0181299948","LAS CHOAPAS"]
[1003,2023,{"$f":"CONCATENATE(Tabla1[[#This Row],[NIVEL5]],\"-\",Tabla1[[#This Row],[NIVEL6]])","v":"1003-2023"},5790003,"SANTANDER, S.A.","92000174787","LAS CHOAPAS"]
[1003,2067,{"$f":"CONCATENATE(Tabla1[[#This Row],[NIVEL5]],\"-\",Tabla1[[#This Row],[NIVEL6]])","v":"1003-2067"},5790005,"SANTANDER, S.A.","65504002236","LAS CHOAPAS"]
[1003,2080,{"$f":"CONCATENATE(Tabla1[[#This Row],[NIVEL5]],\"-\",Tabla1[[#This Row],[NIVEL6]])","v":"1003-2080"},5790006,"SANTANDER, S.A.","65505242282","LAS CHOAPAS"]
[1001,2112,{"$f":"CONCATENATE(Tabla1[[#This Row],[NIVEL5]],\"-\",Tabla1[[#This Row],[NIVEL6]])","v":"1001-2112"},390002,"BBVA BANCOMER, S.A.","01943363721","LAS VIGAS"]
[1002,2001,{"$f":"CONCATENATE(Tabla1[[#This Row],[NIVEL5]],\"-\",Tabla1[[#This Row],[NIVEL6]])","v":"1002-2001"},9000002,"BANAMEX, S.A.","7090608","MALTRATA"]
[1001,2009,{"$f":"CONCATENATE(Tabla1[[#This Row],[NIVEL5]],\"-\",Tabla1[[#This Row],[NIVEL6]])","v":"1001-2009"},200004,"BBVA BANCOMER, S.A.","0181302213","MARTÍNEZ DE LA TORRE"]
[1001,2141,{"$f":"CONCATENATE(Tabla1[[#This Row],[NIVEL5]],\"-\",Tabla1[[#This Row],[NIVEL6]])","v":"1001-2141"},200007,"BBVA BANCOMER, S.A.",100961485,"MARTÍNEZ DE LA TORRE"]
[1003,2068,{"$f":"CONCATENATE(Tabla1[[#This Row],[NIVEL5]],\"-\",Tabla1[[#This Row],[NIVEL6]])","v":"1003-2068"},200006,"SANTANDER, S.A.","65504002253","MARTÍNEZ DE LA TORRE"]
[1006,2002,{"$f":"CONCATENATE(Tabla1[[#This Row],[NIVEL5]],\"-\",Tabla1[[#This Row],[NIVEL6]])","v":"1006-2002"},200001,"BANORTE, S.A.","00561564249","MARTÍNEZ DE LA TORRE"]
[1006,2003,{"$f":"CONCATENATE(Tabla1[[#This Row],[NIVEL5]],\"-\",Tabla1[[#This Row],[NIVEL6]])","v":"1006-2003"},200003,"BANORTE, S.A.","00664717834","MARTÍNEZ DE LA TORRE"]
[1001,2055,{"$f":"CONCATENATE(Tabla1[[#This Row],[NIVEL5]],\"-\",Tabla1[[#This Row],[NIVEL6]])","v":"1001-2055"},5480012,"BBVA BANCOMER, S.A.","0181085204","MINATITLÁN"]
[1001,2103,{"$f":"CONCATENATE(Tabla1[[#This Row],[NIVEL5]],\"-\",Tabla1[[#This Row],[NIVEL6]])","v":"1001-2103"},5480014,"BBVA BANCOMER, S.A.","019353945","MINATITLÁN"]
[1003,2038,{"$f":"CONCATENATE(Tabla1[[#This Row],[NIVEL5]],\"-\",Tabla1[[#This Row],[NIVEL6]])","v":"1003-2038"},5480013,"SANTANDER, S.A.","65503374403","MINATITLÁN"]
[1005,2005,{"$f":"CONCATENATE(Tabla1[[#This Row],[NIVEL5]],\"-\",Tabla1[[#This Row],[NIVEL6]])","v":"1005-2005"},5480003,"HSBC","4013782727","MINATITLÁN"]
[1006,2013,{"$f":"CONCATENATE(Tabla1[[#This Row],[NIVEL5]],\"-\",Tabla1[[#This Row],[NIVEL6]])","v":"1006-2013"},5480010,"BANORTE, S.A.","603348732","MINATITLÁN"]
[1006,2014,{"$f":"CONCATENATE(Tabla1[[#This Row],[NIVEL5]],\"-\",Tabla1[[#This Row],[NIVEL6]])","v":"1006-2014"},5480011,"BANORTE, S.A.","0642081391","MINATITLÁN"]
[1001,2047,{"$f":"CONCATENATE(Tabla1[[#This Row],[NIVEL5]],\"-\",Tabla1[[#This Row],[NIVEL6]])","v":"1001-2047"},5220005,"BBVA BANCOMER, S.A.","0181307568","MISANTLA"]
[1002,2015,{"$f":"CONCATENATE(Tabla1[[#This Row],[NIVEL5]],\"-\",Tabla1[[#This Row],[NIVEL6]])","v":"1002-2015"},5220006,"BANAMEX, S.A.","168262-4","MISANTLA"]
[1002,2018,{"$f":"CONCATENATE(Tabla1[[#This Row],[NIVEL5]],\"-\",Tabla1[[#This Row],[NIVEL6]])","v":"1002-2018"},5910002,"BANAMEX, S.A.","8015005","NANCHITAL"]
[1003,2053,{"$f":"CONCATENATE(Tabla1[[#This Row],[NIVEL5]],\"-\",Tabla1[[#This Row],[NIVEL6]])","v":"1003-2053"},5910003,"SANTANDER, S.A.","65503748513","NANCHITAL"]
[1001,2046,{"$f":"CONCATENATE(Tabla1[[#This Row],[NIVEL5]],\"-\",Tabla1[[#This Row],[NIVEL6]])","v":"1001-2046"},5170004,"BBVA BANCOMER, S.A.","0181307207","NARANJOS"]
[1001,2125,{"$f":"CONCATENATE(Tabla1[[#This Row],[NIVEL5]],\"-\",Tabla1[[#This Row],[NIVEL6]])","v":"1001-2125"},5170006,"BBVA BANCOMER, S.A.",100962090,"NARANJOS"]
[1003,2066,{"$f":"CONCATENATE(Tabla1[[#This Row],[NIVEL5]],\"-\",Tabla1[[#This Row],[NIVEL6]])","v":"1003-2066"},5170005,"SANTANDER, S.A.","655004002267","NARANJOS"]
[1001,2023,{"$f":"CONCATENATE(Tabla1[[#This Row],[NIVEL5]],\"-\",Tabla1[[#This Row],[NIVEL6]])","v":"1001-2023"},640002,"BBVA BANCOMER, S.A.","0181106597","NOGALES"]
[1002,2011,{"$f":"CONCATENATE(Tabla1[[#This Row],[NIVEL5]],\"-\",Tabla1[[#This Row],[NIVEL6]])","v":"1002-2011"},640001,"BANAMEX, S.A.","7078985","NOGALES"]
[1001,2068,{"$f":"CONCATENATE(Tabla1[[#This Row],[NIVEL5]],\"-\",Tabla1[[#This Row],[NIVEL6]])","v":"1001-2068"},9000003,"BBVA BANCOMER, S.A.","0148489572","OFICINAS CENTRALES"]
[1001,2069,{"$f":"CONCATENATE(Tabla1[[#This Row],[NIVEL5]],\"-\",Tabla1[[#This Row],[NIVEL6]])","v":"1001-2069"},9000005,"BBVA BANCOMER, S.A.",109618384,"OFICINAS CENTRALES"]
[1001,2080,{"$f":"CONCATENATE(Tabla1[[#This Row],[NIVEL5]],\"-\",Tabla1[[#This Row],[NIVEL6]])","v":"1001-2080"},9000040,"BBVA BANCOMER, S.A.","0186445241","OFICINAS CENTRALES"]
[1001,2116,{"$f":"CONCATENATE(Tabla1[[#This Row],[NIVEL5]],\"-\",Tabla1[[#This Row],[NIVEL6]])","v":"1001-2116"},9000088,"BBVA BANCOMER, S.A.",102660091,"OFICINAS CENTRALES"]
[1001,2151,{"$f":"CONCATENATE(Tabla1[[#This Row],[NIVEL5]],\"-\",Tabla1[[#This Row],[NIVEL6]])","v":"1001-2151"},9000089,"BBVA BANCOMER, S.A.",105010136,"OFICINAS CENTRALES"]
[1003,2025,{"$f":"CONCATENATE(Tabla1[[#This Row],[NIVEL5]],\"-\",Tabla1[[#This Row],[NIVEL6]])","v":"1003-2025"},9000014,"SANTANDER, S.A.","51908155339","OFICINAS CENTRALES"]
[1003,2026,{"$f":"CONCATENATE(Tabla1[[#This Row],[NIVEL5]],\"-\",Tabla1[[#This Row],[NIVEL6]])","v":"1003-2026"},9000015,"SANTANDER, S.A.","65500722896","OFICINAS CENTRALES"]
[1003,2028,{"$f":"CONCATENATE(Tabla1[[#This Row],[NIVEL5]],\"-\",Tabla1[[#This Row],[NIVEL6]])","v":"1003-2028"},9000016,"SANTANDER, S.A.","65500723229","OFICINAS CENTRALES"]
[1003,2030,{"$f":"CONCATENATE(Tabla1[[#This Row],[NIVEL5]],\"-\",Tabla1[[#This Row],[NIVEL6]])","v":"1003-2030"},9000044,"SANTANDER, S.A.","65503446450","OFICINAS CENTRALES"]
[1003,2069,{"$f":"CONCATENATE(Tabla1[[#This Row],[NIVEL5]],\"-\",Tabla1[[#This Row],[NIVEL6]])","v":"1003-2069"},9000077,"SANTANDER, S.A.","65504701046","OFICINAS CENTRALES"]
[1003,2076,{"$f":"CONCATENATE(Tabla1[[#This Row],[NIVEL5]],\"-\",Tabla1[[#This Row],[NIVEL6]])","v":"1003-2076"},9000087,"SANTANDER, S.A.","65504875192","OFICINAS CENTRALES"]
[1004,2008,{"$f":"CONCATENATE(Tabla1[[#This Row],[NIVEL5]],\"-\",Tabla1[[#This Row],[NIVEL6]])","v":"1004-2008"},9000012,"SCOTIABANK  INVERLAT","5600292877","OFICINAS CENTRALES"]
[1004,2009,{"$f":"CONCATENATE(Tabla1[[#This Row],[NIVEL5]],\"-\",Tabla1[[#This Row],[NIVEL6]])","v":"1004-2009"},9000013,"SCOTIABANK  INVERLAT",5601245589,"OFICINAS CENTRALES"]
[1004,2014,{"$f":"CONCATENATE(Tabla1[[#This Row],[NIVEL5]],\"-\",Tabla1[[#This Row],[NIVEL6]])","v":"1004-2014"},9000068,"SCOTIABANK  INVERLAT","5601909622","OFICINAS CENTRALES"]
[1004,2015,{"$f":"CONCATENATE(Tabla1[[#This Row],[NIVEL5]],\"-\",Tabla1[[#This Row],[NIVEL6]])","v":"1004-2015"},9000069,"SCOTIABANK  INVERLAT","5601909630","OFICINAS CENTRALES"]
[1004,2016,{"$f":"CONCATENATE(Tabla1[[#This Row],[NIVEL5]],\"-\",Tabla1[[#This Row],[NIVEL6]])","v":"1004-2016"},9000070,"SCOTIABANK  INVERLAT","5601909649","OFICINAS CENTRALES"]
[1004,2017,{"$f":"CONCATENATE(Tabla1[[#This Row],[NIVEL5]],\"-\",Tabla1[[#This Row],[NIVEL6]])","v":"1004-2017"},9000071,"SCOTIABANK  INVERLAT","5601909703","OFICINAS CENTRALES"]
[1004,2020,{"$f":"CONCATENATE(Tabla1[[#This Row],[NIVEL5]],\"-\",Tabla1[[#This Row],[NIVEL6]])","v":"1004-2020"},9000074,"SCOTIABANK  INVERLAT","5601909592","OFICINAS CENTRALES"]
[1004,2021,{"$f":"CONCATENATE(Tabla1[[#This Row],[NIVEL5]],\"-\",Tabla1[[#This Row],[NIVEL6]])","v":"1004-2021"},9000075,"SCOTIABANK  INVERLAT","5602043157","OFICINAS CENTRALES"]
[1004,2028,{"$f":"CONCATENATE(Tabla1[[#This Row],[NIVEL5]],\"-\",Tabla1[[#This Row],[NIVEL6]])","v":"1004-2028"},9000079,"SCOTIABANK  INVERLAT","05602066793","OFICINAS CENTRALES"]
[1005,2009,{"$f":"CONCATENATE(Tabla1[[#This Row],[NIVEL5]],\"-\",Tabla1[[#This Row],[NIVEL6]])","v":"1005-2009"},9000034,"HSBC","4049633167","OFICINAS CENTRALES"]
[1006,2016,{"$f":"CONCATENATE(Tabla1[[#This Row],[NIVEL5]],\"-\",Tabla1[[#This Row],[NIVEL6]])","v":"1006-2016"},9000006,"BANORTE, S.A.","0505870234","OFICINAS CENTRALES"]
[1006,2017,{"$f":"CONCATENATE(Tabla1[[#This Row],[NIVEL5]],\"-\",Tabla1[[#This Row],[NIVEL6]])","v":"1006-2017"},9000007,"BANORTE, S.A.","00510204440","OFICINAS CENTRALES"]
[1006,2018,{"$f":"CONCATENATE(Tabla1[[#This Row],[NIVEL5]],\"-\",Tabla1[[#This Row],[NIVEL6]])","v":"1006-2018"},9000008,"BANORTE, S.A.","0510204459","OFICINAS CENTRALES"]
[1001,2034,{"$f":"CONCATENATE(Tabla1[[#This Row],[NIVEL5]],\"-\",Tabla1[[#This Row],[NIVEL6]])","v":"1001-2034"},2170002,"BBVA BANCOMER, S.A.","0181306081","OTATITLÁN"]
[1001,2133,{"$f":"CONCATENATE(Tabla1[[#This Row],[NIVEL5]],\"-\",Tabla1[[#This Row],[NIVEL6]])","v":"1001-2133"},2170004,"BBVA BANCOMER, S.A.",100974358,"OTATITLÁN"]
[1001,2037,{"$f":"CONCATENATE(Tabla1[[#This Row],[NIVEL5]],\"-\",Tabla1[[#This Row],[NIVEL6]])","v":"1001-2037"},5090005,"BBVA BANCOMER, S.A.","0181305549","PÁNUCO"]
[1001,2038,{"$f":"CONCATENATE(Tabla1[[#This Row],[NIVEL5]],\"-\",Tabla1[[#This Row],[NIVEL6]])","v":"1001-2038"},5090006,"BBVA BANCOMER, S.A.","0187675550","PÁNUCO"]
[1001,2039,{"$f":"CONCATENATE(Tabla1[[#This Row],[NIVEL5]],\"-\",Tabla1[[#This Row],[NIVEL6]])","v":"1001-2039"},5090007,"BBVA BANCOMER, S.A.","0190504386","PÁNUCO"]
[1001,2105,{"$f":"CONCATENATE(Tabla1[[#This Row],[NIVEL5]],\"-\",Tabla1[[#This Row],[NIVEL6]])","v":"1001-2105"},5090008,"BBVA BANCOMER, S.A.","0193253880","PÁNUCO"]
[1003,2013,{"$f":"CONCATENATE(Tabla1[[#This Row],[NIVEL5]],\"-\",Tabla1[[#This Row],[NIVEL6]])","v":"1003-2013"},5090003,"SANTANDER, S.A.","66500660112","PÁNUCO"]
[1003,2049,{"$f":"CONCATENATE(Tabla1[[#This Row],[NIVEL5]],\"-\",Tabla1[[#This Row],[NIVEL6]])","v":"1003-2049"},5090009,"SANTANDER, S.A.","65503748007","PÁNUCO"]
[1001,2084,{"$f":"CONCATENATE(Tabla1[[#This Row],[NIVEL5]],\"-\",Tabla1[[#This Row],[NIVEL6]])","v":"1001-2084"},5100005,"BBVA BANCOMER, S.A.","0181305204","PAPANTLA"]
[1001,2107,{"$f":"CONCATENATE(Tabla1[[#This Row],[NIVEL5]],\"-\",Tabla1[[#This Row],[NIVEL6]])","v":"1001-2107"},5100008,"BBVA BANCOMER, S.A.","0193252809","PAPANTLA"]
[1003,2048,{"$f":"CONCATENATE(Tabla1[[#This Row],[NIVEL5]],\"-\",Tabla1[[#This Row],[NIVEL6]])","v":"1003-2048"},5100009,"SANTANDER, S.A.","65503748359","PAPANTLA"]
[1006,2023,{"$f":"CONCATENATE(Tabla1[[#This Row],[NIVEL5]],\"-\",Tabla1[[#This Row],[NIVEL6]])","v":"1006-2023"},5100010,"BANORTE, S.A.","0204714211","PAPANTLA"]
[1002,2023,{"$f":"CONCATENATE(Tabla1[[#This Row],[NIVEL5]],\"-\",Tabla1[[#This Row],[NIVEL6]])","v":"1002-2023"},310004,"BANAMEX, S.A.","2101311","PASO DEL MACHO"]
[1001,2033,{"$f":"CONCATENATE(Tabla1[[#This Row],[NIVEL5]],\"-\",Tabla1[[#This Row],[NIVEL6]])","v":"1001-2033"},1570003,"BBVA BANCOMER, S.A.","0181313932","PEÑUELA"]
[1001,2120,{"$f":"CONCATENATE(Tabla1[[#This Row],[NIVEL5]],\"-\",Tabla1[[#This Row],[NIVEL6]])","v":"1001-2120"},1570004,"BBVA BANCOMER, S.A.",100962252,"PEÑUELA"]
[1001,2048,{"$f":"CONCATENATE(Tabla1[[#This Row],[NIVEL5]],\"-\",Tabla1[[#This Row],[NIVEL6]])","v":"1001-2048"},5410007,"BBVA BANCOMER, S.A.","0181307754","PEROTE"]
[1001,2140,{"$f":"CONCATENATE(Tabla1[[#This Row],[NIVEL5]],\"-\",Tabla1[[#This Row],[NIVEL6]])","v":"1001-2140"},5410008,"BBVA BANCOMER, S.A.",1000962406,"PEROTE"]
[1006,2012,{"$f":"CONCATENATE(Tabla1[[#This Row],[NIVEL5]],\"-\",Tabla1[[#This Row],[NIVEL6]])","v":"1006-2012"},5410006,"BANORTE, S.A.","0637130567","PEROTE"]
[1005,2002,{"$f":"CONCATENATE(Tabla1[[#This Row],[NIVEL5]],\"-\",Tabla1[[#This Row],[NIVEL6]])","v":"1005-2002"},670001,"HSBC","4023393176","PIEDRAS NEGRAS"]
[1001,2082,{"$f":"CONCATENATE(Tabla1[[#This Row],[NIVEL5]],\"-\",Tabla1[[#This Row],[NIVEL6]])","v":"1001-2082"},110002,"BBVA BANCOMER, S.A.","0160063312","PLATÓN SÁNCHEZ"]
[1001,2137,{"$f":"CONCATENATE(Tabla1[[#This Row],[NIVEL5]],\"-\",Tabla1[[#This Row],[NIVEL6]])","v":"1001-2137"},110004,"BBVA BANCOMER, S.A.",100962619,"PLATÓN SÁNCHEZ"]
[1001,2027,{"$f":"CONCATENATE(Tabla1[[#This Row],[NIVEL5]],\"-\",Tabla1[[#This Row],[NIVEL6]])","v":"1001-2027"},800001,"BBVA BANCOMER, S.A.","0162156938","PLAYA VICENTE"]
[1001,2028,{"$f":"CONCATENATE(Tabla1[[#This Row],[NIVEL5]],\"-\",Tabla1[[#This Row],[NIVEL6]])","v":"1001-2028"},800004,"BBVA BANCOMER, S.A.","0181308491","PLAYA VICENTE"]
[1001,2157,{"$f":"CONCATENATE(Tabla1[[#This Row],[NIVEL5]],\"-\",Tabla1[[#This Row],[NIVEL6]])","v":"1001-2157"},800005,"BBVA BANCOMER, S.A.",100962910,"PLAYA VICENTE"]
[1001,2045,{"$f":"CONCATENATE(Tabla1[[#This Row],[NIVEL5]],\"-\",Tabla1[[#This Row],[NIVEL6]])","v":"1001-2045"},5160005,"BBVA BANCOMER, S.A.","0181311255","POZA RICA"]
[1001,2106,{"$f":"CONCATENATE(Tabla1[[#This Row],[NIVEL5]],\"-\",Tabla1[[#This Row],[NIVEL6]])","v":"1001-2106"},5160008,"BBVA BANCOMER, S.A.","0193253406","POZA RICA"]
[1003,2014,{"$f":"CONCATENATE(Tabla1[[#This Row],[NIVEL5]],\"-\",Tabla1[[#This Row],[NIVEL6]])","v":"1003-2014"},5160001,"SANTANDER, S.A.","65500733273","POZA RICA"]
[1003,2015,{"$f":"CONCATENATE(Tabla1[[#This Row],[NIVEL5]],\"-\",Tabla1[[#This Row],[NIVEL6]])","v":"1003-2015"},5160004,"SANTANDER, S.A.","65502844109","POZA RICA"]
[1003,2031,{"$f":"CONCATENATE(Tabla1[[#This Row],[NIVEL5]],\"-\",Tabla1[[#This Row],[NIVEL6]])","v":"1003-2031"},5160006,"SANTANDER, S.A.","65503497720","POZA RICA"]
[1003,2046,{"$f":"CONCATENATE(Tabla1[[#This Row],[NIVEL5]],\"-\",Tabla1[[#This Row],[NIVEL6]])","v":"1003-2046"},5160007,"SANTANDER, S.A.","65503748237","POZA RICA"]
[1006,2011,{"$f":"CONCATENATE(Tabla1[[#This Row],[NIVEL5]],\"-\",Tabla1[[#This Row],[NIVEL6]])","v":"1006-2011"},5160003,"BANORTE, S.A.","0617006901","POZA RICA"]
[1001,2059,{"$f":"CONCATENATE(Tabla1[[#This Row],[NIVEL5]],\"-\",Tabla1[[#This Row],[NIVEL6]])","v":"1001-2059"},5780002,"BBVA BANCOMER, S.A.","0181309161","RÍO BLANCO"]
[1001,2149,{"$f":"CONCATENATE(Tabla1[[#This Row],[NIVEL5]],\"-\",Tabla1[[#This Row],[NIVEL6]])","v":"1001-2149"},5780004,"BBVA BANCOMER, S.A.",104726154,"RÍO BLANCO"]
[1001,2025,{"$f":"CONCATENATE(Tabla1[[#This Row],[NIVEL5]],\"-\",Tabla1[[#This Row],[NIVEL6]])","v":"1001-2025"},700002,"BBVA BANCOMER, S.A.","0181173146","SALTABARRANCA"]
[1001,2158,{"$f":"CONCATENATE(Tabla1[[#This Row],[NIVEL5]],\"-\",Tabla1[[#This Row],[NIVEL6]])","v":"1001-2158"},700003,"BBVA BANCOMER, S.A.",100974668,"SALTABARRANCA"]
[1001,2155,{"$f":"CONCATENATE(Tabla1[[#This Row],[NIVEL5]],\"-\",Tabla1[[#This Row],[NIVEL6]])","v":"1001-2155"},5880006,"BBVA BANCOMER, S.A.",104783611,"SANTIAGO TUXTLA"]
[1001,2156,{"$f":"CONCATENATE(Tabla1[[#This Row],[NIVEL5]],\"-\",Tabla1[[#This Row],[NIVEL6]])","v":"1001-2156"},5880007,"BBVA BANCOMER, S.A.",104783492,"SANTIAGO TUXTLA"]
[1002,2017,{"$f":"CONCATENATE(Tabla1[[#This Row],[NIVEL5]],\"-\",Tabla1[[#This Row],[NIVEL6]])","v":"1002-2017"},5880005,"BANAMEX, S.A.","5829204","SANTIAGO TUXTLA"]
[1001,2019,{"$f":"CONCATENATE(Tabla1[[#This Row],[NIVEL5]],\"-\",Tabla1[[#This Row],[NIVEL6]])","v":"1001-2019"},490002,"BBVA BANCOMER, S.A.","0176483585","SAYULA DE ALEMAN"]
[1001,2020,{"$f":"CONCATENATE(Tabla1[[#This Row],[NIVEL5]],\"-\",Tabla1[[#This Row],[NIVEL6]])","v":"1001-2020"},490003,"BBVA BANCOMER, S.A.","0181189069","SAYULA DE ALEMAN"]
[1001,2142,{"$f":"CONCATENATE(Tabla1[[#This Row],[NIVEL5]],\"-\",Tabla1[[#This Row],[NIVEL6]])","v":"1001-2142"},490004,"BBVA BANCOMER, S.A.",100975850,"SAYULA DE ALEMAN"]
[1003,2012,{"$f":"CONCATENATE(Tabla1[[#This Row],[NIVEL5]],\"-\",Tabla1[[#This Row],[NIVEL6]])","v":"1003-2012"},5030001,"SANTANDER, S.A.","65500810757","SOLEDAD DE DOBLADO"]
[1003,2056,{"$f":"CONCATENATE(Tabla1[[#This Row],[NIVEL5]],\"-\",Tabla1[[#This Row],[NIVEL6]])","v":"1003-2056"},5030004,"SANTANDER, S.A.","65503748470","SOLEDAD DE DOBLADO"]
[1003,2078,{"$f":"CONCATENATE(Tabla1[[#This Row],[NIVEL5]],\"-\",Tabla1[[#This Row],[NIVEL6]])","v":"1003-2078"},5030005,"SANTANDER, S.A.","65505019668","SOLEDAD DE DOBLADO"]
[1001,2041,{"$f":"CONCATENATE(Tabla1[[#This Row],[NIVEL5]],\"-\",Tabla1[[#This Row],[NIVEL6]])","v":"1001-2041"},5120004,"BBVA BANCOMER, S.A.","0443101029","TANTOYUCA"]
[1001,2042,{"$f":"CONCATENATE(Tabla1[[#This Row],[NIVEL5]],\"-\",Tabla1[[#This Row],[NIVEL6]])","v":"1001-2042"},5120005,"BBVA BANCOMER, S.A.","0181172581","TANTOYUCA"]
[1001,2134,{"$f":"CONCATENATE(Tabla1[[#This Row],[NIVEL5]],\"-\",Tabla1[[#This Row],[NIVEL6]])","v":"1001-2134"},5120007,"BBVA BANCOMER, S.A.",100963798,"TANTOYUCA"]
[1003,2060,{"$f":"CONCATENATE(Tabla1[[#This Row],[NIVEL5]],\"-\",Tabla1[[#This Row],[NIVEL6]])","v":"1003-2060"},5120006,"SANTANDER, S.A.","65503748069","TANTOYUCA"]
[1002,2002,{"$f":"CONCATENATE(Tabla1[[#This Row],[NIVEL5]],\"-\",Tabla1[[#This Row],[NIVEL6]])","v":"1002-2002"},130001,"BANAMEX, S.A.","1141317","TEMPOAL "]
[1001,2031,{"$f":"CONCATENATE(Tabla1[[#This Row],[NIVEL5]],\"-\",Tabla1[[#This Row],[NIVEL6]])","v":"1001-2031"},1220003,"BBVA BANCOMER, S.A.","181310755","TEPETZINTLA"]
[1001,2130,{"$f":"CONCATENATE(Tabla1[[#This Row],[NIVEL5]],\"-\",Tabla1[[#This Row],[NIVEL6]])","v":"1001-2130"},1220004,"BBVA BANCOMER, S.A.",100964212,"TEPETZINTLA"]
[1001,2026,{"$f":"CONCATENATE(Tabla1[[#This Row],[NIVEL5]],\"-\",Tabla1[[#This Row],[NIVEL6]])","v":"1001-2026"},710002,"BBVA BANCOMER, S.A.","0181309951","TEZONAPA"]
[1001,2119,{"$f":"CONCATENATE(Tabla1[[#This Row],[NIVEL5]],\"-\",Tabla1[[#This Row],[NIVEL6]])","v":"1001-2119"},710003,"BBVA BANCOMER, S.A.",100964484,"TEZONAPA"]
[1004,2011,{"$f":"CONCATENATE(Tabla1[[#This Row],[NIVEL5]],\"-\",Tabla1[[#This Row],[NIVEL6]])","v":"1004-2011"},740002,"SCOTIABANK  INVERLAT","10352821","TLACOTALPAN"]
[1005,2019,{"$f":"CONCATENATE(Tabla1[[#This Row],[NIVEL5]],\"-\",Tabla1[[#This Row],[NIVEL6]])","v":"1005-2019"},9000097,"HSBC","4058949249","TLALIXCOYAN"]
[1007,2001,{"$f":"CONCATENATE(Tabla1[[#This Row],[NIVEL5]],\"-\",Tabla1[[#This Row],[NIVEL6]])","v":"1007-2001"},930003,"BANSEFI","586000606878113","TLALTETELA "]
[1001,2010,{"$f":"CONCATENATE(Tabla1[[#This Row],[NIVEL5]],\"-\",Tabla1[[#This Row],[NIVEL6]])","v":"1001-2010"},210003,"BBVA BANCOMER, S.A.","0181172050","TLAPACOYAN"]
[1001,2132,{"$f":"CONCATENATE(Tabla1[[#This Row],[NIVEL5]],\"-\",Tabla1[[#This Row],[NIVEL6]])","v":"1001-2132"},210004,"BBVA BANCOMER, S.A.",1009676040,"TLAPACOYAN"]
[1001,2014,{"$f":"CONCATENATE(Tabla1[[#This Row],[NIVEL5]],\"-\",Tabla1[[#This Row],[NIVEL6]])","v":"1001-2014"},340002,"BBVA BANCOMER, S.A.","181313339","TOMATLÁN"]
[1001,2126,{"$f":"CONCATENATE(Tabla1[[#This Row],[NIVEL5]],\"-\",Tabla1[[#This Row],[NIVEL6]])","v":"1001-2126"},340003,"BBVA BANCOMER, S.A.",100966908,"TOMATLÁN"]
[1003,2008,{"$f":"CONCATENATE(Tabla1[[#This Row],[NIVEL5]],\"-\",Tabla1[[#This Row],[NIVEL6]])","v":"1003-2008"},840004,"SANTANDER, S.A.","92001581875","TRES VALLLES"]
[1001,2043,{"$f":"CONCATENATE(Tabla1[[#This Row],[NIVEL5]],\"-\",Tabla1[[#This Row],[NIVEL6]])","v":"1001-2043"},5150004,"BBVA BANCOMER, S.A.","0107332505","TUXPAN"]
[1001,2044,{"$f":"CONCATENATE(Tabla1[[#This Row],[NIVEL5]],\"-\",Tabla1[[#This Row],[NIVEL6]])","v":"1001-2044"},5150011,"BBVA BANCOMER, S.A.","0189486259","TUXPAN"]
[1001,2108,{"$f":"CONCATENATE(Tabla1[[#This Row],[NIVEL5]],\"-\",Tabla1[[#This Row],[NIVEL6]])","v":"1001-2108"},5150012,"BBVA BANCOMER, S.A.","0193252957","TUXPAN"]
[1003,2050,{"$f":"CONCATENATE(Tabla1[[#This Row],[NIVEL5]],\"-\",Tabla1[[#This Row],[NIVEL6]])","v":"1003-2050"},5150013,"SANTANDER, S.A.","65503748314","TUXPAN"]
[1006,2006,{"$f":"CONCATENATE(Tabla1[[#This Row],[NIVEL5]],\"-\",Tabla1[[#This Row],[NIVEL6]])","v":"1006-2006"},5150003,"BANORTE, S.A.","0123412252","TUXPAN"]
[1006,2009,{"$f":"CONCATENATE(Tabla1[[#This Row],[NIVEL5]],\"-\",Tabla1[[#This Row],[NIVEL6]])","v":"1006-2009"},5150009,"BANORTE, S.A.","0664033918","TUXPAN"]
[1001,2011,{"$f":"CONCATENATE(Tabla1[[#This Row],[NIVEL5]],\"-\",Tabla1[[#This Row],[NIVEL6]])","v":"1001-2011"},230001,"BBVA BANCOMER, S.A.","0181315129","VEGA DE ALATORRE"]
[1001,2129,{"$f":"CONCATENATE(Tabla1[[#This Row],[NIVEL5]],\"-\",Tabla1[[#This Row],[NIVEL6]])","v":"1001-2129"},230003,"BBVA BANCOMER, S.A.",100967203,"VEGA DE ALATORRE"]
[1003,2006,{"$f":"CONCATENATE(Tabla1[[#This Row],[NIVEL5]],\"-\",Tabla1[[#This Row],[NIVEL6]])","v":"1003-2006"},550001,"SANTANDER, S.A.","92000161247","VILLA AZUETA"]
[1001,2051,{"$f":"CONCATENATE(Tabla1[[#This Row],[NIVEL5]],\"-\",Tabla1[[#This Row],[NIVEL6]])","v":"1001-2051"},5440011,"BBVA BANCOMER, S.A.","0181312863","XICO"]
[1001,2127,{"$f":"CONCATENATE(Tabla1[[#This Row],[NIVEL5]],\"-\",Tabla1[[#This Row],[NIVEL6]])","v":"1001-2127"},5440012,"BBVA BANCOMER, S.A.",100968943,"XICO"]
[1001,2102,{"$f":"CONCATENATE(Tabla1[[#This Row],[NIVEL5]],\"-\",Tabla1[[#This Row],[NIVEL6]])","v":"1001-2102"},350001,"BBVA BANCOMER, S.A.","0193061663","YANGA"]
[1001,2145,{"$f":"CONCATENATE(Tabla1[[#This Row],[NIVEL5]],\"-\",Tabla1[[#This Row],[NIVEL6]])","v":"1001-2145"},350002,"BBVA BANCOMER, S.A.",100969974,"YANGA"]

{"sheet":"CONCILIACIÓN BANC.","index":2,"n_rows":34,"n_cols":9,"rows_kept":34,"cut":false,"hidden":true,"merged":[[24,5,24,7],[2,1,2,8],[7,7,7,8],[12,4,12,5],[12,7,12,8],[4,1,4,8],[5,7,5,8],[5,1,5,4],[7,2,7,3],[9,2,9,3],[9,7,9,8],[3,1,3,5]]}
[]
[]
[]
[null,"CONCILIACION BANCARIA",null,null,null,null,null,"CONAC",{"$f":"IFERROR(IF(MATCH(DATOS!C12,DATOS!F14:F37,0)>0,DATOS!C12,\"\"),\"ERROR\")","v":"ERROR"}]
[]
[null,{"$f":"CONCATENATE(\"OFICINA OPERADORA: \",DATOS!C8)","v":"OFICINA OPERADORA: SELECCIÓN"},null,null,null,"No. AUXILIAR:",null,{"$f":"IF(DATOS!C10=0,\"INGRESAR DATO\",DATOS!C10)","v":"INGRESAR DATO"}]
[]
[null,"BANCO: ",{"$f":"IF(DATOS!C14=\"\",\"ERROR\",DATOS!C14)","v":"ERROR"},null,null,"No. CTA/CLABE:",null,{"$f":"IF(DATOS!C16=0,\"INGRESAR DATO\",DATOS!C16)","v":"INGRESAR DATO"}]
[null,null,null,null,null,null," "]
[null,"MES:",{"$f":"IF(DATOS!K8=\"\",\"INDICAR MES\",DATOS!K8)","v":"DICIEMBRE"},null,null,"AÑO:",null,{"$f":"IF(DATOS!K10=\"\",\"INDICAR AÑO\",DATOS!K10)","v":"2016"}]
[]
[]
[null,null,null,null,"AUXILIAR",null,null,"BANCO"]
[null,null,null,null,"DEBE  ","HABER",null,"DEBE  ","HABER"]
[null,null,"SALDO  A LA FECHA  ",null,1000,null,null,null,1000]
[]
[null,null,"AUXILIAR"]
[null,null,"PENDIENTES  DE  CONCILIAR",null," "]
[]
[null,"ANEXO  1","DEPOSITOS DEL  BANCO  NO  CONSIDERADOS  EN  LIBROS",null,{"$f":"'ANEXO 1'!F44","v":0}]
[]
[null,"ANEXO  2","CARGOS  DEL  BANCO  NO  CONSIDERADOS  EN  LIBROS",null,null,{"$f":"'ANEXO 2'!F44","v":0}]
[]
[null,null,"BANCO"]
[null,"ANEXO 3","DEPOSITOS NO CONSIDERADOS  POR EL  BANCO",null,null,"DESCUADRADA",null,null,{"$f":"'ANEXO 3'!F44","v":0}]
[]
[null,"ANEXO  4","CHEQUES  AUN  NO  PAGADOS POR EL  BANCO",null,null,null,null,{"$f":"'ANEXO 4 '!F44","v":500}]
[]
[null,null,"PENDIENTES  DE  ACLARAR  POR EL  BANCO"]
[null,"ANEXO  5","POR  TODOS LOS  CARGOS  Y/O ABONOS  EFECTUADOS  POR   EL  BANCO NO CORRESPONDIENTES  A  LA CUENTA  EN  PROCESO",null,null,null,null,null,0]
[]
[null,null,"SUMAS",null,{"$f":"SUM(E15:E31)","v":1000},{"$f":"SUM(F15:F31)","v":0},null,{"$f":"SUM(H15:H31)","v":500},{"$f":"SUM(I15:I31)","v":1000}]
[null,null,"SALDOS  CONCILIADOS",null,null,{"$f":"+E32-F32","v":1000},null,{"$f":"I32-H32","v":500}]
[null,null,"SUMAS  IGUALES",null,{"$f":"SUM(E32:E33)","v":1000},{"$f":"SUM(F32:F33)","v":1000},null,{"$f":"SUM(H32:H33)","v":1000},{"$f":"SUM(I32:I33)","v":1000}]

{"sheet":"ANEXO 1","index":3,"n_rows":44,"n_cols":6,"rows_kept":44,"cut":false,"hidden":true,"merged":[[6,2,6,3],[8,2,8,3],[10,1,11,5],[4,1,4,3],[2,1,2,3]]}
[]
[]
[null,"CONCILIACION BANCARIA",null,null,"CONAC",{"$f":"'CONCILIACIÓN BANC.'!I4","v":"ERROR"}]
[]
[null,{"$f":"'CONCILIACIÓN BANC.'!B6:E6","v":"OFICINA OPERADORA: SELECCIÓN"},null,null,"No. AUXILIAR:",{"$f":"'CONCILIACIÓN BANC.'!H6","v":"INGRESAR DATO"}]
[]
[null,"BANCO:",{"$f":"'CONCILIACIÓN BANC.'!C8","v":"ERROR"},null,"No. CTA/CLABE:",{"$f":"'CONCILIACIÓN BANC.'!H8","v":"INGRESAR DATO"}]
[null,null,null,null,null," "]
[null,"MES:",{"$f":"'CONCILIACIÓN BANC.'!C10:D10","v":"DICIEMBRE"},null,"AÑO:",{"$f":"'CONCILIACIÓN BANC.'!H10","v":"2016"}]
[]
[null,"ANEXO 1 .-  DEPÓSITOS DEL BANCO NO CONSIDERADOS EN LIBROS"]
[]
[]
[null,"FECHA","IMPORTE",null,"FECHA","IMPORTE"]
[]
[]
[]
[]
[]
[]
[]
[]
[]
[]
[]
[]
[]
[]
[]
[]
[]
[]
[]
[]
[]
[]
[]
[]
[]
[]
[]
[]
[]
[null,"SUMA:",{"$f":"SUM(C15:C43)","v":0},null,"SUMA:",{"$f":"SUM(F15:F43)","v":0}]

{"sheet":"ANEXO 2","index":4,"n_rows":44,"n_cols":6,"rows_kept":44,"cut":false,"hidden":true,"merged":[[10,1,11,5],[6,2,6,3],[8,2,8,3],[4,1,4,3],[2,1,2,3]]}
[]
[]
[null,"CONCILIACION BANCARIA",null,null,"CONAC",{"$f":"'CONCILIACIÓN BANC.'!I4","v":"ERROR"}]
[]
[null,{"$f":"'CONCILIACIÓN BANC.'!B6:E6","v":"OFICINA OPERADORA: SELECCIÓN"},null,null,"No. AUXILIAR:",{"$f":"'CONCILIACIÓN BANC.'!H6","v":"INGRESAR DATO"}]
[]
[null,"BANCO:",{"$f":"'CONCILIACIÓN BANC.'!C8","v":"ERROR"},null,"No. CTA/CLABE:",{"$f":"'CONCILIACIÓN BANC.'!H8","v":"INGRESAR DATO"}]
[null,null,null,null,null," "]
[null,"MES:",{"$f":"'CONCILIACIÓN BANC.'!C10:D10","v":"DICIEMBRE"},null,"AÑO:",{"$f":"'CONCILIACIÓN BANC.'!H10","v":"2016"}]
[]
[null,"ANEXO 2 .-  CARGOS DEL BANCO NO CONSIDERADOS EN  LIBROS"]
[]
[]
[null,"FECHA","IMPORTE",null,"FECHA","IMPORTE"]
[]
[]
[]
[]
[]
[]
[]
[]
[]
[]
[]
[]
[]
[]
[]
[]
[]
[]
[]
[]
[]
[]
[]
[]
[]
[]
[]
[]
[]
[null,"SUMA:",{"$f":"SUM(C15:C43)","v":0},null,"SUMA:",{"$f":"SUM(F15:F43)","v":0}]

{"sheet":"ANEXO 3","index":5,"n_rows":44,"n_cols":6,"rows_kept":44,"cut":false,"hidden":true,"merged":[[10,1,11,5],[6,2,6,3],[4,1,4,3],[8,2,8,3],[2,1,2,3]]}
[]
[]
[null,"CONCILIACION BANCARIA",null,null,"CONAC",{"$f":"'CONCILIACIÓN BANC.'!I4","v":"ERROR"}]
[]
[null,{"$f":"'CONCILIACIÓN BANC.'!B6:E6","v":"OFICINA OPERADORA: SELECCIÓN"},null,null,"No. AUXILIAR:",{"$f":"'CONCILIACIÓN BANC.'!H6","v":"INGRESAR DATO"}]
[]
[null,"BANCO:",{"$f":"'CONCILIACIÓN BANC.'!C8","v":"ERROR"},null,"No. CTA/CLABE:",{"$f":"'CONCILIACIÓN BANC.'!H8","v":"INGRESAR DATO"}]
[null,null,null,null,null," "]
[null,"MES:",{"$f":"'CONCILIACIÓN BANC.'!C10:D10","v":"DICIEMBRE"},null,"AÑO:",{"$f":"'CONCILIACIÓN BANC.'!H10","v":"2016"}]
[]
[null,"ANEXO 3 .-  DEPOSITOS NO CONSIDERADOS POR EL BANCO"]
[]
[]
[null,"FECHA","IMPORTE",null,"FECHA","IMPORTE"]
[]
[]
[]
[]
[]
[]
[]
[]
[]
[]
[]
[]
[]
[]
[]
[]
[]
[]
[]
[]
[]
[]
[]
[]
[]
[]
[]
[]
[]
[null,"SUMA:",{"$f":"SUM(C15:C43)","v":0},null,"SUMA:",{"$f":"SUM(F15:F43)","v":0}]

{"sheet":"ANEXO 4 ","index":6,"n_rows":44,"n_cols":6,"rows_kept":44,"cut":false,"hidden":true,"merged":[[33,3,33,4],[22,3,22,4],[28,3,28,4],[29,3,29,4],[30,3,30,4],[31,3,31,4],[32,3,32,4],[23,3,23,4],[24,3,24,4],[25,3,25,4],[26,3,26,4],[27,3,27,4],[40,3,40,4],[41,3,41,4],[34,3,34,4],[35,3,35,4],[36,3,36,4],[37,3,37,4],[38,3,38,4],[39,3,39,4],[2,1,2,3],[4,1,4,3],[21,3,21,4],[13,3,13,4],[14,3,14,4],[15,3,15,4],[10,1,11,5],[16,3,16,4],[17,3,17,4],[18,3,18,4],[19,3,19,4],[20,3,20,4],[6,2,6,3],[8,2,8,3]]}
[]
[]
[null,"CONCILIACION BANCARIA",null,null,"CONAC",{"$f":"'CONCILIACIÓN BANC.'!I4","v":"ERROR"}]
[]
[null,{"$f":"'CONCILIACIÓN BANC.'!B6:E6","v":"OFICINA OPERADORA: SELECCIÓN"},null,null,"No. AUXILIAR:",{"$f":"'CONCILIACIÓN BANC.'!H6","v":"INGRESAR DATO"}]
[]
[null,"BANCO:",{"$f":"'CONCILIACIÓN BANC.'!C8","v":"ERROR"},null,"No. CTA/CLABE:",{"$f":"'CONCILIACIÓN BANC.'!H8","v":"INGRESAR DATO"}]
[null,null,null,null,null," "]
[null,"MES:",{"$f":"'CONCILIACIÓN BANC.'!C10:D10","v":"DICIEMBRE"},null,"AÑO:",{"$f":"'CONCILIACIÓN BANC.'!H10","v":"2016"}]
[]
[null,"ANEXO 4 .-  CHEQUES AÚN NO PAGADOS POR EL BANCO"]
[]
[]
[null,"FECHA","Nº DE CHEQUE","BENEFICIARIO",null,"IMPORTE"]
[null,null,null,null,null,500]
[]
[]
[]
[]
[]
[]
[]
[]
[]
[]
[]
[]
[]
[]
[]
[]
[]
[]
[]
[]
[]
[]
[]
[]
[]
[]
[]
[]
[null,null,"SUMA:",null,null,{"$f":"SUM(F15:F42)","v":500}]

{"sheet":"ANEXO 5","index":7,"n_rows":44,"n_cols":7,"rows_kept":44,"cut":false,"hidden":true,"merged":[[2,1,2,4],[10,1,11,6],[4,1,4,4],[6,2,6,3],[8,2,8,3]]}
[]
[]
[null,"CONCILIACION BANCARIA",null,null,null,"CONAC",{"$f":"'CONCILIACIÓN BANC.'!I4","v":"ERROR"}]
[]
[null,{"$f":"'CONCILIACIÓN BANC.'!B6:E6","v":"OFICINA OPERADORA: SELECCIÓN"},null,null,null,"No. AUXILIAR:",{"$f":"'CONCILIACIÓN BANC.'!H6","v":"INGRESAR DATO"}]
[]
[null,"BANCO:",{"$f":"'CONCILIACIÓN BANC.'!C8:D8","v":"ERROR"},null,null,"No. CTA/CLABE:",{"$f":"'CONCILIACIÓN BANC.'!H8","v":"INGRESAR DATO"}]
[null,null,null,null,null,null," "]
[null,"MES:",{"$f":"'CONCILIACIÓN BANC.'!C10:D10","v":"DICIEMBRE"},null,null,"AÑO:",{"$f":"'CONCILIACIÓN BANC.'!H10","v":"2016"}]
[]
[null,"ANEXO 5 .-  CARGOS Y/O ABONOS EFECTUADOS POR EL BANCO NO CORRESPONDIENTES A LA CUENTA EN PROCESO"]
[]
[]
[null,"FECHA","Nº DE CHEQUE Y/O CARGO","IMPORTE","FECHA","DEPÓSITO Y/O ABONO","IMPORTE"]
[]
[]
[]
[]
[]
[]
[]
[]
[]
[]
[]
[]
[]
[]
[]
[]
[]
[]
[]
[]
[]
[]
[]
[]
[]
[]
[]
[]
[]
[null,null,"SUMA:",{"$f":"SUM(D15:D42)","v":0},null,"SUMA:",{"$f":"SUM(G15:G42)","v":0}]